{"text_format":"1","workbook":"xlsx","n_sheets":18,"sheets":["MENU","CARATULA","C. FILIACION","CODIGO Y FOTOGRAFIA ","ASIS. 1° B","VAL. 1° B","ASIS. 2° B","VAL. 2° B","ASIS. 3° B","VAL. 3° B","ASIS. 4° B","VAL. 4° B","CENTRALIZADOR","% REP-APR","CEN. POR AREA","BOLETINES ","NOT_ALT","EST_DEST"],"not_rendered":{"charts":9,"images":15,"macros":1,"external_links":5,"defined_names":117,"comments":5,"pivot_tables":0},"unopened":[],"bounds":{"document_bytes":16777216,"sheet_cells":100000,"rows_first":2000,"rows_last":500,"rows_between":2000,"halvings":0,"cell_chars":16384,"cell_head_chars":4096},"cells_cut":0,"cells_raw":0,"read":"whole","date_system":"1900"}

{"sheet":"MENU","index":0,"n_rows":0,"n_cols":0,"rows_kept":0,"cut":false,"hidden":false,"merged":[]}

{"sheet":"CARATULA","index":1,"n_rows":85,"n_cols":6,"rows_kept":85,"cut":false,"hidden":false,"merged":[[11,3,11,7],[39,3,39,6],[15,6,15,7],[17,6,17,7],[19,6,19,7],[21,6,21,7],[23,6,23,7],[25,6,25,7],[29,6,29,7],[31,6,31,7],[33,6,33,7]]}
[]
[]
[]
[]
[]
[null,null,null,null,null,{"$f":"CONCATENATE(CARATULA!G28,\" \",[5]INICIO!BH6)","v":" B"}]
[]
[]
{"$rows_left_out":78}
{"sheet":"C. FILIACION","index":2,"n_rows":100,"n_cols":18,"rows_kept":100,"cut":false,"hidden":false,"merged":[[60,4,60,7],[61,4,61,7],[1,1,2,16],[12,2,12,3],[12,5,12,7],[12,11,12,12],[4,15,4,16],[9,15,10,16]]}
[]
[null,"REGISTRO Y CUADRO DE FILIACIÓN "]
[]
[]
[null,null,"UNIDAD EDUCATIVA ",":",{"$f":"CARATULA!G20","v":0},null,null,null,null,null,"FECHA:",{"$f":"TODAY()","v":"2018-06-13"},null,"TOTAL FEMENINO (F)","TOTAL MASCULINO (M)","DATOS DE REGISTRO"]
[null,null,"NIVEL ",":",{"$f":"CARATULA!G26","v":0},null,null,null,null,null,null,null,null,{"$f":"COUNTIF(E14:E58,\"F\")","v":0},{"$f":"COUNTIF(E14:E58,\"M\")","v":0},"INSCRITOS",{"$f":"COUNTIF(R14:R58,\"*\")","v":0}]
[null,null,"AÑO DE ESCOLARIDAD",":",{"$f":"CONCATENATE(CARATULA!G28,\" \",CARATULA!H28)","v":" "},null,null,null,null,null,null,null,null,null,null,"RETIRO O ABANDONO",{"$f":"COUNTIF(R14:R58,\"RETIRO O ABANDONO\")","v":0}]
[null,null,"DIRECTOR/A",":",{"$f":"CARATULA!G22","v":0},null,null,null,null,null,null,null,null,null,null,"NO INCORPORADO",{"$f":"COUNTIF(R14:R58,\"NO INCORPORADO\")","v":0}]
{"$rows_left_out":93}
{"sheet":"CODIGO Y FOTOGRAFIA ","index":3,"n_rows":47,"n_cols":5,"rows_kept":47,"cut":false,"hidden":false,"merged":[]}
[]
[null,"CÓDIGO ","APELLIDOS Y NOMBRES ","FOTOGRAFÍA "]
[null,"A1",{"$f":"'C. FILIACION'!C14:D14","v":0},null,"IMAG1"]
[null,"A2",{"$f":"'C. FILIACION'!C15:D15","v":0},null,"IMAG2"]
[null,"A3",{"$f":"'C. FILIACION'!C16:D16","v":0},null,"IMAG3"]
[null,"A4",{"$f":"'C. FILIACION'!C17:D17","v":0},null,"IMAG4"]
[null,"A5",{"$f":"'C. FILIACION'!C18:D18","v":0},null,"IMAG5"]
[null,"A6",{"$f":"'C. FILIACION'!C19:D19","v":0},null,"IMAG6"]
{"$rows_left_out":40}
{"sheet":"ASIS. 1° B","index":4,"n_rows":63,"n_cols":34,"rows_kept":63,"cut":false,"hidden":false,"merged":[[1,1,2,33],[4,24,4,29],[6,24,6,29],[4,30,4,32],[6,30,6,32],[3,1,3,33],[12,1,13,1],[12,4,12,28],[12,29,12,32],[8,24,8,29],[8,30,8,32],[24,2,24,3],[12,33,13,33],[62,4,62,14],[62,20,62,29],[12,2,13,3],[14,2,14,3],[15,2,15,3],[16,2,16,3],[17,2,17,3],[18,2,18,3],[19,2,19,3],[20,2,20,3],[21,2,21,3],[22,2,22,3],[23,2,23,3],[36,2,36,3],[25,2,25,3],[26,2,26,3],[27,2,27,3],[28,2,28,3],[29,2,29,3],[30,2,30,3],[31,2,31,3],[32,2,32,3],[33,2,33,3],[34,2,34,3],[35,2,35,3],[45,2,45,3],[46,2,46,3],[55,2,55,3],[56,2,56,3],[47,2,47,3],[48,2,48,3],[37,2,37,3],[38,2,38,3],[39,2,39,3],[40,2,40,3],[41,2,41,3],[42,2,42,3],[43,2,43,3],[44,2,44,3],[57,2,57,3],[58,2,58,3],[49,2,49,3],[50,2,50,3],[51,2,51,3],[52,2,52,3],[53,2,53,3],[54,2,54,3]]}
[]
[null,"REGISTRO DE ASISTENCIA 1⁰ BIMESTRE "]
[]
[]
[null,null,"UNIDAD EDUCATIVA ",":",{"$f":"CARATULA!G20","v":0},null,null,null,null,null,null,null,null,null,null,null,null,null,null,null,null,null,null,null,"INICIO DE BIMESTRE ",null,null,null,null,null,"2018-02-05"]
[null,null,"NIVEL ",":",{"$f":"CARATULA!G26","v":0}]
[null,null,"AÑO DE ESCOLARIDAD",":",{"$f":"CONCATENATE(CARATULA!G28,\" \",CARATULA!H28)","v":" "},null,null,null,null,null,null,null,null,null,null,null,null,null,null,null,null,null,null,null,"FIN DE BIMESTRE ",null,null,null,null,null,"2018-04-20"]
[null,null,"DIRECTOR/A",":",{"$f":"CARATULA!G22","v":0}]
{"$rows_left_out":56}
{"sheet":"VAL. 1° B","index":5,"n_rows":68,"n_cols":52,"rows_kept":68,"cut":false,"hidden":false,"merged":[[66,8,66,19],[66,30,66,42],[67,8,67,19],[67,30,67,42],[16,4,16,8],[16,10,16,14],[16,36,16,40],[16,42,16,46],[16,9,17,9],[16,25,17,25],[16,41,17,41],[13,51,17,51],[13,1,16,2],[13,48,13,49],[14,48,14,49],[16,48,17,48],[16,49,17,49],[16,20,16,24],[16,31,16,35],[16,15,16,19],[16,26,16,30],[15,10,15,25],[15,26,15,41],[16,47,17,47],[15,42,15,47],[13,50,17,50],[2,1,3,51],[5,29,5,33],[7,29,7,33],[5,50,6,51],[7,50,11,51],[64,48,64,49],[9,29,9,33],[65,48,65,49],[5,35,5,41],[7,35,7,41],[5,42,5,43],[7,42,7,43],[6,35,6,41],[6,42,6,43],[13,3,13,47],[14,3,14,47],[15,3,15,9],[5,44,11,49],[9,21,9,27]]}
[]
[]
[null,"REGISTRO DE VALORACIÓN 1⁰ BIMESTRE"]
[]
[]
[null,null,"UNIDAD EDUCATIVA ",":",null,{"$f":"CARATULA!G20","v":0},null,null,null,null,null,null,null,null,null,null,null,null,null,null,null,"INICIO DE BIMESTRE ",null,null,null,null,null,null,":","2018-02-05",null,null,null,null,null,null,null,null,null,null,null,null,null,null,null,null,null,null,null,null,"DÍAS RESTANTES PARA FIN DE BIMESTRE "]
[null,null,"NIVEL ",":",null,{"$f":"CARATULA!G26","v":0},null,null,null,null,null,null,null,null,null,null,null,null,null,null,null,null,null,null,null,null,null,null,null,null,null,null,null,null,null,"N° TOTAL APROBADOS",null,null,null,null,null,null,{"$f":"COUNTIF(AY19:AY63,\">=51\")","v":0}]
[null,null,"AÑO DE ESCOLARIDAD",":",null,{"$f":"CONCATENATE(CARATULA!G28,\" \",CARATULA!H28)","v":" "},null,null,null,null,null,null,null,null,null,null,null,null,null,null,null,"FIN DE BIMESTRE ",null,null,null,null,null,null,":","2018-04-20",null,null,null,null,null,"N° TOTAL REPROBADOS",null,null,null,null,null,null,{"$f":"COUNTIFS(AY19:AY63,\">=1\",AY19:AY63,\"<=50\")","v":0},null,null,null,null,null,null,null,{"$f":"AD8-AD10","v":-54}]
{"$rows_left_out":61}
{"sheet":"ASIS. 2° B","index":6,"n_rows":70,"n_cols":34,"rows_kept":70,"cut":false,"hidden":false,"merged":[[62,20,62,29],[54,2,54,3],[55,2,55,3],[56,2,56,3],[57,2,57,3],[58,2,58,3],[62,4,62,14],[53,2,53,3],[42,2,42,3],[43,2,43,3],[44,2,44,3],[45,2,45,3],[46,2,46,3],[47,2,47,3],[48,2,48,3],[49,2,49,3],[50,2,50,3],[51,2,51,3],[52,2,52,3],[41,2,41,3],[30,2,30,3],[31,2,31,3],[32,2,32,3],[33,2,33,3],[34,2,34,3],[35,2,35,3],[36,2,36,3],[37,2,37,3],[38,2,38,3],[39,2,39,3],[40,2,40,3],[12,33,13,33],[14,2,14,3],[15,2,15,3],[16,2,16,3],[29,2,29,3],[18,2,18,3],[19,2,19,3],[20,2,20,3],[21,2,21,3],[22,2,22,3],[23,2,23,3],[24,2,24,3],[25,2,25,3],[26,2,26,3],[27,2,27,3],[28,2,28,3],[17,2,17,3],[12,1,13,1],[12,2,13,3],[12,4,12,28],[8,24,8,29],[12,29,12,32],[8,30,8,32],[1,1,2,33],[3,1,3,33],[4,24,4,29],[4,30,4,32],[6,24,6,29],[6,30,6,32]]}
[]
[null,"REGISTRO DE ASISTENCIA 2⁰ BIMESTRE "]
[]
[]
[null,null,"UNIDAD EDUCATIVA ",":",{"$f":"CARATULA!G20","v":0},null,null,null,null,null,null,null,null,null,null,null,null,null,null,null,null,null,null,null,"INICIO DE BIMESTRE ",null,null,null,null,null,"2018-04-23"]
[null,null,"NIVEL ",":",{"$f":"CARATULA!G26","v":0}]
[null,null,"AÑO DE ESCOLARIDAD",":",{"$f":"CONCATENATE(CARATULA!G28,\" \",CARATULA!H28)","v":" "},null,null,null,null,null,null,null,null,null,null,null,null,null,null,null,null,null,null,null,"FIN DE BIMESTRE ",null,null,null,null,null,"2018-06-29"]
[null,null,"DIRECTOR/A",":",{"$f":"CARATULA!G22","v":0}]
{"$rows_left_out":63}
{"sheet":"VAL. 2° B","index":7,"n_rows":68,"n_cols":52,"rows_kept":68,"cut":false,"hidden":false,"merged":[[66,8,66,19],[66,30,66,42],[67,8,67,19],[67,30,67,42],[7,21,7,27],[9,21,9,27],[7,29,7,33],[7,35,7,41],[7,42,7,43],[65,48,65,49],[53,2,53,3],[54,2,54,3],[55,2,55,3],[56,2,56,3],[57,2,57,3],[58,2,58,3],[59,2,59,3],[60,2,60,3],[61,2,61,3],[62,2,62,3],[64,48,64,49],[52,2,52,3],[41,2,41,3],[42,2,42,3],[43,2,43,3],[44,2,44,3],[45,2,45,3],[46,2,46,3],[47,2,47,3],[48,2,48,3],[49,2,49,3],[50,2,50,3],[51,2,51,3],[40,2,40,3],[29,2,29,3],[30,2,30,3],[31,2,31,3],[32,2,32,3],[33,2,33,3],[34,2,34,3],[35,2,35,3],[36,2,36,3],[37,2,37,3],[38,2,38,3],[39,2,39,3],[23,2,23,3],[24,2,24,3],[25,2,25,3],[26,2,26,3],[27,2,27,3],[28,2,28,3],[16,49,17,49],[18,2,18,3],[19,2,19,3],[20,2,20,3],[21,2,21,3],[22,2,22,3],[16,31,16,35],[16,36,16,40],[16,41,17,41],[16,42,16,46],[16,47,17,47],[16,48,17,48],[13,1,16,2],[16,25,17,25],[16,26,16,30],[13,51,17,51],[14,3,14,47],[14,48,14,49],[15,3,15,9],[15,10,15,25],[15,26,15,41],[15,42,15,47],[16,4,16,8],[16,9,17,9],[16,10,16,14],[13,3,13,47],[13,48,13,49],[13,50,17,50],[16,15,16,19],[16,20,16,24],[2,1,3,51],[5,29,5,33],[5,35,5,41],[5,42,5,43],[5,44,11,49],[5,50,6,51],[6,35,6,41],[6,42,6,43],[7,50,11,51],[9,29,9,33]]}
[]
[]
[null,"REGISTRO DE VALORACIÓN 2⁰ BIMESTRE"]
[]
[]
[null,null,"UNIDAD EDUCATIVA ",":",null,{"$f":"CARATULA!G20","v":0},null,null,null,null,null,null,null,null,null,null,null,null,null,null,null,"INICIO DE BIMESTRE ",null,null,null,null,null,null,":","2018-04-23",null,null,null,null,null,null,null,null,null,null,null,null,null,null,null,null,null,null,null,null,"DÍAS RESTANTES PARA FIN DE BIMESTRE "]
[null,null,"NIVEL ",":",null,{"$f":"CARATULA!G26","v":0},null,null,null,null,null,null,null,null,null,null,null,null,null,null,null,null,null,null,null,null,null,null,null,null,null,null,null,null,null,"N° TOTAL APROBADOS",null,null,null,null,null,null,{"$f":"COUNTIF(AY19:AY63,\">=51\")","v":0}]
[null,null,"AÑO DE ESCOLARIDAD",":",null,{"$f":"CONCATENATE(CARATULA!G28,\" \",CARATULA!H28)","v":" "},null,null,null,null,null,null,null,null,null,null,null,null,null,null,null,"FIN DE BIMESTRE ",null,null,null,null,null,null,":","2018-06-29",null,null,null,null,null,"N° TOTAL REPROBADOS",null,null,null,null,null,null,{"$f":"COUNTIFS(AY19:AY63,\">=1\",AY19:AY63,\"<=50\")","v":0},null,null,null,null,null,null,null,{"$f":"AD8-AD10","v":16}]
{"$rows_left_out":61}
{"sheet":"ASIS. 3° B","index":8,"n_rows":70,"n_cols":34,"rows_kept":70,"cut":false,"hidden":false,"merged":[[1,1,2,33],[3,1,3,33],[4,24,4,29],[4,30,4,32],[6,24,6,29],[6,30,6,32],[17,2,17,3],[12,1,13,1],[12,2,13,3],[12,4,12,28],[8,24,8,29],[12,29,12,32],[8,30,8,32],[12,33,13,33],[14,2,14,3],[15,2,15,3],[16,2,16,3],[40,2,40,3],[29,2,29,3],[18,2,18,3],[19,2,19,3],[20,2,20,3],[21,2,21,3],[22,2,22,3],[23,2,23,3],[24,2,24,3],[25,2,25,3],[26,2,26,3],[27,2,27,3],[28,2,28,3],[35,2,35,3],[36,2,36,3],[37,2,37,3],[38,2,38,3],[41,2,41,3],[39,2,39,3],[30,2,30,3],[31,2,31,3],[32,2,32,3],[33,2,33,3],[34,2,34,3],[62,20,62,29],[54,2,54,3],[55,2,55,3],[56,2,56,3],[57,2,57,3],[58,2,58,3],[62,4,62,14],[53,2,53,3],[42,2,42,3],[43,2,43,3],[44,2,44,3],[45,2,45,3],[46,2,46,3],[47,2,47,3],[48,2,48,3],[49,2,49,3],[50,2,50,3],[51,2,51,3],[52,2,52,3]]}
[]
[null,"REGISTRO DE ASISTENCIA 3⁰ BIMESTRE "]
[]
[]
[null,null,"UNIDAD EDUCATIVA ",":",{"$f":"CARATULA!G20","v":0},null,null,null,null,null,null,null,null,null,null,null,null,null,null,null,null,null,null,null,"INICIO DE BIMESTRE ",null,null,null,null,null,"2018-07-02"]
[null,null,"NIVEL ",":",{"$f":"CARATULA!G26","v":0}]
[null,null,"AÑO DE ESCOLARIDAD",":",{"$f":"CONCATENATE(CARATULA!G28,\" \",CARATULA!H28)","v":" "},null,null,null,null,null,null,null,null,null,null,null,null,null,null,null,null,null,null,null,"FIN DE BIMESTRE ",null,null,null,null,null,"2018-09-21"]
[null,null,"DIRECTOR/A",":",{"$f":"CARATULA!G22","v":0}]
{"$rows_left_out":63}
{"sheet":"VAL. 3° B","index":9,"n_rows":68,"n_cols":52,"rows_kept":68,"cut":false,"hidden":false,"merged":[[2,1,3,51],[5,29,5,33],[5,35,5,41],[5,42,5,43],[5,44,11,49],[5,50,6,51],[6,35,6,41],[6,42,6,43],[7,50,11,51],[9,29,9,33],[13,51,17,51],[14,3,14,47],[14,48,14,49],[15,3,15,9],[15,10,15,25],[15,26,15,41],[15,42,15,47],[16,4,16,8],[16,9,17,9],[13,50,17,50],[16,26,16,30],[13,3,13,47],[13,48,13,49],[16,10,16,14],[16,15,16,19],[16,20,16,24],[19,2,19,3],[20,2,20,3],[16,42,16,46],[16,47,17,47],[25,2,25,3],[22,2,22,3],[23,2,23,3],[24,2,24,3],[21,2,21,3],[18,2,18,3],[13,1,16,2],[16,25,17,25],[16,31,16,35],[16,36,16,40],[16,41,17,41],[26,2,26,3],[39,2,39,3],[28,2,28,3],[29,2,29,3],[30,2,30,3],[31,2,31,3],[32,2,32,3],[33,2,33,3],[34,2,34,3],[35,2,35,3],[36,2,36,3],[37,2,37,3],[38,2,38,3],[27,2,27,3],[62,2,62,3],[51,2,51,3],[40,2,40,3],[41,2,41,3],[42,2,42,3],[43,2,43,3],[44,2,44,3],[45,2,45,3],[46,2,46,3],[47,2,47,3],[48,2,48,3],[49,2,49,3],[50,2,50,3],[57,2,57,3],[58,2,58,3],[59,2,59,3],[60,2,60,3],[61,2,61,3],[52,2,52,3],[53,2,53,3],[54,2,54,3],[55,2,55,3],[56,2,56,3],[65,48,65,49],[66,8,66,19],[66,30,66,42],[67,8,67,19],[67,30,67,42],[64,48,64,49],[16,48,17,48],[16,49,17,49],[7,29,7,33],[7,35,7,41],[7,42,7,43]]}
[]
[]
[null,"REGISTRO DE VALORACIÓN 3⁰ BIMESTRE"]
[]
[]
[null,null,"UNIDAD EDUCATIVA ",":",null,{"$f":"CARATULA!G20","v":0},null,null,null,null,null,null,null,null,null,null,null,null,null,null,null,"INICIO DE BIMESTRE ",null,null,null,null,null,null,":","2018-07-02",null,null,null,null,null,null,null,null,null,null,null,null,null,null,null,null,null,null,null,null,"DÍAS RESTANTES PARA FIN DE BIMESTRE "]
[null,null,"NIVEL ",":",null,{"$f":"CARATULA!G26","v":0},null,null,null,null,null,null,null,null,null,null,null,null,null,null,null,null,null,null,null,null,null,null,null,null,null,null,null,null,null,"N° TOTAL APROBADOS",null,null,null,null,null,null,{"$f":"COUNTIF(AY19:AY63,\">=51\")","v":0}]
[null,null,"AÑO DE ESCOLARIDAD",":",null,{"$f":"CONCATENATE(CARATULA!G28,\" \",CARATULA!H28)","v":" "},null,null,null,null,null,null,null,null,null,null,null,null,null,null,null,"FIN DE BIMESTRE ",null,null,null,null,null,null,":","2018-09-21",null,null,null,null,null,"N° TOTAL REPROBADOS",null,null,null,null,null,null,{"$f":"COUNTIFS(AY19:AY63,\">=1\",AY19:AY63,\"<=50\")","v":0},null,null,null,null,null,null,null,{"$f":"AD8-AD10","v":100}]
{"$rows_left_out":61}
{"sheet":"ASIS. 4° B","index":10,"n_rows":70,"n_cols":34,"rows_kept":70,"cut":false,"hidden":false,"merged":[[1,1,2,33],[3,1,3,33],[4,24,4,29],[4,30,4,32],[6,24,6,29],[6,30,6,32],[17,2,17,3],[12,1,13,1],[12,2,13,3],[12,4,12,28],[8,24,8,29],[12,29,12,32],[8,30,8,32],[12,33,13,33],[14,2,14,3],[15,2,15,3],[16,2,16,3],[40,2,40,3],[29,2,29,3],[18,2,18,3],[19,2,19,3],[20,2,20,3],[21,2,21,3],[22,2,22,3],[23,2,23,3],[24,2,24,3],[25,2,25,3],[26,2,26,3],[27,2,27,3],[28,2,28,3],[35,2,35,3],[36,2,36,3],[37,2,37,3],[38,2,38,3],[41,2,41,3],[39,2,39,3],[30,2,30,3],[31,2,31,3],[32,2,32,3],[33,2,33,3],[34,2,34,3],[62,20,62,29],[54,2,54,3],[55,2,55,3],[56,2,56,3],[57,2,57,3],[58,2,58,3],[62,4,62,14],[53,2,53,3],[42,2,42,3],[43,2,43,3],[44,2,44,3],[45,2,45,3],[46,2,46,3],[47,2,47,3],[48,2,48,3],[49,2,49,3],[50,2,50,3],[51,2,51,3],[52,2,52,3]]}
[]
[null,"REGISTRO DE ASISTENCIA 4⁰ BIMESTRE "]
[]
[]
[null,null,"UNIDAD EDUCATIVA ",":",{"$f":"CARATULA!G20","v":0},null,null,null,null,null,null,null,null,null,null,null,null,null,null,null,null,null,null,null,"INICIO DE BIMESTRE ",null,null,null,null,null,"2018-09-24"]
[null,null,"NIVEL ",":",{"$f":"CARATULA!G26","v":0}]
[null,null,"AÑO DE ESCOLARIDAD",":",{"$f":"CONCATENATE(CARATULA!G28,\" \",CARATULA!H28)","v":" "},null,null,null,null,null,null,null,null,null,null,null,null,null,null,null,null,null,null,null,"FIN DE BIMESTRE ",null,null,null,null,null,"2018-12-06"]
[null,null,"DIRECTOR/A",":",{"$f":"CARATULA!G22","v":0}]
{"$rows_left_out":63}
{"sheet":"VAL. 4° B","index":11,"n_rows":68,"n_cols":52,"rows_kept":68,"cut":false,"hidden":false,"merged":[[2,1,3,51],[5,29,5,33],[5,35,5,41],[5,42,5,43],[5,44,11,49],[5,50,6,51],[6,35,6,41],[6,42,6,43],[7,50,11,51],[9,29,9,33],[16,48,17,48],[16,49,17,49],[7,29,7,33],[7,35,7,41],[7,42,7,43],[13,51,17,51],[14,3,14,47],[14,48,14,49],[15,3,15,9],[15,10,15,25],[15,26,15,41],[15,42,15,47],[16,4,16,8],[16,9,17,9],[13,50,17,50],[16,26,16,30],[13,3,13,47],[13,48,13,49],[16,10,16,14],[16,15,16,19],[16,20,16,24],[19,2,19,3],[20,2,20,3],[16,42,16,46],[16,47,17,47],[25,2,25,3],[22,2,22,3],[23,2,23,3],[24,2,24,3],[21,2,21,3],[18,2,18,3],[13,1,16,2],[16,25,17,25],[16,31,16,35],[16,36,16,40],[16,41,17,41],[26,2,26,3],[39,2,39,3],[28,2,28,3],[29,2,29,3],[30,2,30,3],[31,2,31,3],[32,2,32,3],[33,2,33,3],[34,2,34,3],[35,2,35,3],[36,2,36,3],[37,2,37,3],[38,2,38,3],[27,2,27,3],[51,2,51,3],[40,2,40,3],[41,2,41,3],[42,2,42,3],[43,2,43,3],[44,2,44,3],[45,2,45,3],[46,2,46,3],[47,2,47,3],[48,2,48,3],[49,2,49,3],[50,2,50,3],[64,48,64,49],[52,2,52,3],[53,2,53,3],[54,2,54,3],[55,2,55,3],[56,2,56,3],[57,2,57,3],[58,2,58,3],[59,2,59,3],[60,2,60,3],[61,2,61,3],[62,2,62,3],[65,48,65,49],[66,8,66,19],[66,30,66,42],[67,8,67,19],[67,30,67,42]]}
[]
[]
[null,"REGISTRO DE VALORACIÓN 4⁰ BIMESTRE"]
[]
[]
[null,null,"UNIDAD EDUCATIVA ",":",null,{"$f":"CARATULA!G20","v":0},null,null,null,null,null,null,null,null,null,null,null,null,null,null,null,"INICIO DE BIMESTRE ",null,null,null,null,null,null,":","2018-09-24",null,null,null,null,null,null,null,null,null,null,null,null,null,null,null,null,null,null,null,null,"DÍAS RESTANTES PARA FIN DE BIMESTRE "]
[null,null,"NIVEL ",":",null,{"$f":"CARATULA!G26","v":0},null,null,null,null,null,null,null,null,null,null,null,null,null,null,null,null,null,null,null,null,null,null,null,null,null,null,null,null,null,"N° TOTAL APROBADOS",null,null,null,null,null,null,{"$f":"COUNTIF(AY19:AY63,\">=51\")","v":0}]
[null,null,"AÑO DE ESCOLARIDAD",":",null,{"$f":"CONCATENATE(CARATULA!G28,\" \",CARATULA!H28)","v":" "},null,null,null,null,null,null,null,null,null,null,null,null,null,null,null,"FIN DE BIMESTRE ",null,null,null,null,null,null,":","2018-12-06",null,null,null,null,null,"N° TOTAL REPROBADOS",null,null,null,null,null,null,{"$f":"COUNTIFS(AY19:AY63,\">=1\",AY19:AY63,\"<=50\")","v":0},null,null,null,null,null,null,null,{"$f":"AD8-AD10","v":176}]
{"$rows_left_out":61}
{"sheet":"CENTRALIZADOR","index":12,"n_rows":63,"n_cols":33,"rows_kept":63,"cut":false,"hidden":false,"merged":[[62,3,62,10],[62,17,62,24],[11,24,11,30],[9,18,9,25],[8,27,8,31],[9,27,9,31],[11,31,13,31],[1,1,1,26],[1,27,1,32],[8,18,8,19],[8,20,8,21],[8,22,8,23],[8,24,8,25],[11,1,13,1],[11,2,13,2],[11,3,11,9],[11,10,11,16],[11,17,11,23],[12,3,12,6],[11,32,13,32],[12,7,12,8],[12,9,13,9],[12,10,12,13],[12,14,12,15],[12,16,13,16],[12,17,12,20],[12,21,12,22],[12,23,13,23],[12,24,12,27],[12,28,12,29],[12,30,13,30]]}
[]
[null,"                CENTRALIZADOR DE NOTAS ",null,null,null,null,null,null,null,null,null,null,null,null,null,null,null,null,null,null,null,null,null,null,null,null,null,{"$f":"TODAY()","v":"2018-06-13"}]
[]
[null,null,"UNIDAD EDUCATIVA ",null,{"$f":"CARATULA!G20","v":0}]
[null,null,"NIVEL ",null,{"$f":"CARATULA!G26","v":0}]
[null,null,"AÑO DE ESCOLARIDAD",null,{"$f":"CONCATENATE(CARATULA!G28,\" \",CARATULA!H28)","v":" "}]
[null,null,"DIRECTOR(A)",null,{"$f":"CARATULA!G22","v":0}]
[null,null,"MAESTRO(A)",null,{"$f":"CARATULA!G24","v":0}]
{"$rows_left_out":56}
{"sheet":"% REP-APR","index":13,"n_rows":34,"n_cols":12,"rows_kept":34,"cut":false,"hidden":false,"merged":[[2,2,2,11],[33,2,33,4],[33,8,33,11],[18,2,19,11],[9,2,9,11],[11,3,11,4],[12,3,12,4],[13,3,13,4],[14,3,14,4],[15,3,15,4],[30,3,30,5],[30,7,30,9]]}
[]
[]
[null,null,"CUADRO DE EDADES "]
[]
[null,null,null,12,{"$f":"D5+1","v":13},{"$f":"E5+1","v":14},15,16,17,18,19,"TOTALES "]
[null,null,"FEMENINO",{"$f":"COUNTIFS('C. FILIACION'!I14:I58,\"12\",'C. FILIACION'!E14:E58,\"F\")","v":0},{"$f":"COUNTIFS('C. FILIACION'!I14:I58,\"13\",'C. FILIACION'!E14:E58,\"F\")","v":0},{"$f":"COUNTIFS('C. FILIACION'!I14:I58,\"14\",'C. FILIACION'!E14:E58,\"F\")","v":0},{"$f":"COUNTIFS('C. FILIACION'!I14:I58,\"15\",'C. FILIACION'!E14:E58,\"F\")","v":0},{"$f":"COUNTIFS('C. FILIACION'!I14:I58,\"16\",'C. FILIACION'!E14:E58,\"F\")","v":0},{"$f":"COUNTIFS('C. FILIACION'!I14:I58,\"17\",'C. FILIACION'!E14:E58,\"F\")","v":0},{"$f":"COUNTIFS('C. FILIACION'!I14:I58,\"18\",'C. FILIACION'!E14:E58,\"F\")","v":0},{"$f":"COUNTIFS('C. FILIACION'!I14:I58,\"19\",'C. FILIACION'!E14:E58,\"F\")","v":0},{"$f":"SUM(D6:K6)","v":0}]
[null,null,"MASCULINO ",{"$f":"COUNTIFS('C. FILIACION'!I14:I58,\"12\",'C. FILIACION'!E14:E58,\"M\")","v":0},{"$f":"COUNTIFS('C. FILIACION'!I14:I58,\"13\",'C. FILIACION'!E14:E58,\"M\")","v":0},{"$f":"COUNTIFS('C. FILIACION'!I14:I58,\"14\",'C. FILIACION'!E14:E58,\"M\")","v":0},{"$f":"COUNTIFS('C. FILIACION'!I14:I58,\"15\",'C. FILIACION'!E14:E58,\"M\")","v":0},{"$f":"COUNTIFS('C. FILIACION'!I14:I58,\"16\",'C. FILIACION'!E14:E58,\"M\")","v":0},{"$f":"COUNTIFS('C. FILIACION'!I14:I58,\"17\",'C. FILIACION'!E14:E58,\"M\")","v":0},{"$f":"COUNTIFS('C. FILIACION'!I14:I58,\"18\",'C. FILIACION'!E14:E58,\"M\")","v":0},{"$f":"COUNTIFS('C. FILIACION'!I14:I58,\"19\",'C. FILIACION'!E14:E58,\"M\")","v":0},{"$f":"SUM(D7:K7)","v":0}]
[null,null,"TOTALES ",{"$f":"D6+D7","v":0},{"$f":"E6+E7","v":0},0,0,0,0,0,0,{"$f":"L6+L7","v":0}]
{"$rows_left_out":27}
{"sheet":"CEN. POR AREA","index":14,"n_rows":60,"n_cols":78,"rows_kept":60,"cut":false,"hidden":false,"merged":[[4,3,4,15],[6,3,6,15],[5,3,5,14],[1,1,1,77],[11,77,12,77],[11,57,11,74],[12,1,12,2],[7,3,7,15],[9,3,9,15],[8,3,8,15],[3,3,3,15],[59,8,59,16],[59,26,59,34],[59,44,59,52],[59,62,59,70],[11,1,11,2],[11,3,11,20],[11,21,11,38],[11,39,11,56]]}
[]
[null,"CENTRALIZADOR DE NOTAS POR ÁREAS Y BIMESTRES "]
[]
[null,null,"UNIDAD EDUCATIVA ",{"$f":"CARATULA!G20","v":0}]
[null,null,"NIVEL ",{"$f":"CARATULA!G26","v":0}]
[null,null,"AÑO DE ESCOLARIDAD ",{"$f":"CONCATENATE(CARATULA!G28,\" \",CARATULA!H28)","v":" "}]
[null,null,"DIRECTOR(A)",{"$f":"CARATULA!G22","v":0}]
[null,null,"MAESTRO(A)",{"$f":"CARATULA!G24","v":0}]
{"$rows_left_out":53}
{"sheet":"BOLETINES ","index":15,"n_rows":38,"n_cols":8,"rows_kept":38,"cut":false,"hidden":false,"merged":[[13,4,13,5],[13,6,13,8],[36,5,36,7],[8,6,8,8],[9,6,9,8],[10,6,10,8],[11,6,11,8],[12,6,12,8],[18,2,19,2],[18,3,18,7],[37,5,37,7],[3,1,3,9],[17,2,17,3],[17,4,17,7],[6,2,15,2],[6,4,6,5],[7,4,7,5],[8,4,8,5],[9,4,9,5],[10,4,10,5],[11,4,11,5],[12,4,12,5],[6,6,6,8],[7,6,7,8]]}
[]
[]
[]
[null,"DATOS DEL ESTUDIANTE "]
[null,null,"CÓDIGO DE ESTUDIANTE ","A1"]
[]
[null,null,{"$f":"INDEX('CODIGO Y FOTOGRAFIA '!B3:E47,MATCH('BOLETINES '!D5,'CODIGO Y FOTOGRAFIA '!B3:B47,0),4)","v":"IMAG1"},null,"NOMBRE ",null,{"$f":"INDEX('C. FILIACION'!A14:Q58,MATCH('BOLETINES '!D5,'C. FILIACION'!A14:A58,0),3)","v":0}]
[null,null,null,null,"GÉNERO",null,{"$f":"INDEX('C. FILIACION'!A14:Q58,MATCH('BOLETINES '!D5,'C. FILIACION'!A14:A58,0),5)","v":0}]
{"$rows_left_out":31}
{"sheet":"NOT_ALT","index":16,"n_rows":51,"n_cols":4,"rows_kept":51,"cut":false,"hidden":true,"merged":[]}
[]
[]
[]
[]
[]
["Nº","NOTA","Nº","APELLIDOS Y NOMBRES"]
[1,{"$f":"IF('CEN. POR AREA'!BY$14<=1,\" \",LARGE('CEN. POR AREA'!BY$14:BY$58,1))","v":{"$error":"#NUM!"}},{"$f":"IF(B7<=1,\" \",MATCH(B7,'CEN. POR AREA'!BY$14:BY$58,0))","v":{"$error":"#NUM!"}},{"$f":"LOOKUP(C7,'CEN. POR AREA'!B$14:B$58:'CEN. POR AREA'!C$14:C$58)","v":{"$error":"#NUM!"}}]
[2,{"$f":"IF('CEN. POR AREA'!BY$14<=1,\" \",LARGE('CEN. POR AREA'!BY$14:BY$58,2))","v":{"$error":"#NUM!"}},{"$f":"IF(B8<=1,\" \",MATCH(B8,'CEN. POR AREA'!BY$14:BY$58,0))","v":{"$error":"#NUM!"}},{"$f":"LOOKUP(C8,'CEN. POR AREA'!B$14:B$58:'CEN. POR AREA'!C$14:C$58)","v":{"$error":"#NUM!"}}]
{"$rows_left_out":44}
{"sheet":"EST_DEST","index":17,"n_rows":52,"n_cols":18,"rows_kept":52,"cut":false,"hidden":false,"merged":[[10,1,10,6],[10,7,10,12],[10,13,10,18],[2,2,2,17],[4,5,4,11],[4,12,5,13],[4,14,5,15],[5,5,5,10],[6,2,6,4],[6,5,6,15],[7,2,7,4],[7,5,7,13],[9,1,9,18],[11,1,11,6],[11,7,11,12],[11,13,11,18],[12,1,12,6],[12,7,12,12],[12,13,12,18],[17,4,17,5],[17,6,17,12],[17,13,17,15],[19,4,19,5],[19,6,19,12],[19,13,19,15],[20,4,20,5],[20,6,20,12],[20,13,20,15],[21,4,21,5],[21,6,21,12],[21,13,21,15],[22,4,22,5],[22,6,22,12],[22,13,22,15],[23,4,23,5],[23,6,23,12],[23,13,23,15],[27,13,27,15],[24,4,24,5],[24,6,24,12],[24,13,24,15],[25,4,25,5],[25,6,25,12],[25,13,25,15],[33,4,33,5],[33,6,33,12],[33,13,33,15],[30,4,30,5],[30,6,30,12],[30,13,30,15],[31,4,31,5],[31,6,31,12],[31,13,31,15],[4,1,4,4],[5,1,5,4],[32,4,32,5],[32,6,32,12],[32,13,32,15],[28,4,28,5],[28,6,28,12],[28,13,28,15],[29,4,29,5],[29,6,29,12],[29,13,29,15],[26,4,26,5],[26,6,26,12],[26,13,26,15],[27,4,27,5],[27,6,27,12],[39,2,39,7],[39,13,39,18],[40,2,40,7],[40,13,40,18],[43,17,43,18]]}
[]
[]
[null,null,"ESTUDIANTES DESTACADOS ANUAL"]
[]
[null,"Unidad Educativa:",null,null,null,{"$f":"IF((CARATULA!G20)=0,\"\",(CARATULA!G20))","v":""},null,null,null,null,null,null,"Gestión:",null,{"$f":"IF((CARATULA!G34)=0,\"\",(CARATULA!G34))","v":""}]
[null,"Año de Escolaridad:",null,null,null,{"$f":"CONCATENATE(CARATULA!G28,\" \",CARATULA!H28)","v":" "}]
[null,null,"Nivel:",null,null,{"$f":"IF((CARATULA!G26)=0,\"\",(CARATULA!G26))","v":""}]
[null,null,"Maestro/a:",null,null,{"$f":"IF((CARATULA!G24)=0,\"\",(CARATULA!G24))","v":""}]
{"$rows_left_out":44}