{"text_format":"1","workbook":"xlsx","n_sheets":42,"sheets":["PRESENTACION","GUIA DE USO PARA EL CUADERNO P.","MENU","CARATULA","FILIACION_ESTUDIANTE","FILIACION_PPFF","VACUNAS","ESTADISTICA_EDADES","ASISTENCIA","FEBRERO","MARZO","ABRIL","MAYO","JUNIO","JULIO","AGOSTO","SEPTIEMBRE","OCTUBRE","NOVIEMBRE","DICIEMBRE","VALORACION POR CAMPOS","COM_SOC_1B","COM_SOC_2B","COM_SOC_3B","COM_SOC_4B","COSMOS_PENS_1B","COSMOS_PENS_2B","COSMOS_PENS_3B","COSMOS_PENS_4B","CIENCIA_TEC_1B","CIENCIA_TEC_2B","CIENCIA_TEC_3B","CIENCIA_TEC_4B","VIDA_TIERRA_1B","VIDA_TIERRA_2B","VIDA_TIERRA_3B","VIDA_TIERRA_4B","C. PRIMER B","C. SEGUNDO B","C. TERCER B","C. CUARTO B","INFORME_ANUAL"],"not_rendered":{"charts":1,"images":26,"macros":1,"external_links":0,"defined_names":85,"comments":2,"pivot_tables":0},"unopened":[],"bounds":{"document_bytes":16777216,"sheet_cells":100000,"rows_first":2000,"rows_last":500,"rows_between":2000,"halvings":0,"cell_chars":16384,"cell_head_chars":4096},"cells_cut":0,"cells_raw":0,"read":"whole","date_system":"1900"}

{"sheet":"PRESENTACION","index":0,"n_rows":0,"n_cols":0,"rows_kept":0,"cut":false,"hidden":false,"merged":[]}

{"sheet":"GUIA DE USO PARA EL CUADERNO P.","index":1,"n_rows":0,"n_cols":0,"rows_kept":0,"cut":false,"hidden":false,"merged":[]}

{"sheet":"MENU","index":2,"n_rows":0,"n_cols":0,"rows_kept":0,"cut":false,"hidden":false,"merged":[]}

{"sheet":"CARATULA","index":3,"n_rows":26,"n_cols":22,"rows_kept":26,"cut":false,"hidden":false,"merged":[[12,4,12,7],[11,4,11,7],[0,9,2,9],[6,1,6,8],[10,4,10,7],[10,2,10,3],[11,2,11,3],[12,2,12,3],[7,2,9,7],[13,4,13,7],[19,4,19,7],[18,4,18,7],[17,4,17,7],[14,4,14,7],[15,4,15,7],[16,4,16,7],[13,2,13,3],[14,2,14,3],[17,2,17,3],[18,2,18,3],[19,2,19,3],[21,4,21,7],[20,2,20,3],[25,2,25,4],[25,5,25,7],[20,4,20,7]]}
[]
[]
[]
[]
[]
[]
[null,{"$f":"IF(LEN(E12)=0,\" \",UPPER(E12))","v":" "}]
[]
[]
[]
[null,null,"Departamento:",null,null,null,null,null,null,null,null,null,null,null,null,null,null,null,"UNIDAD EDUCATIVA",null,null,"MCAL. DE ZEPITA"]
[null,null,"Unidad Educativa:",null,null,null,null,null,null,null,null,null,null,null,null,null,null,null,"TURNO",null,"TARDE"]
[null,null,"Turno:",null,null,null,null,null,null,null,null,null,null,null,null,null,null,null,"NIVEL",null,"EDUCACION INICIAL EN FAMILIA COMUNITARIA"]
[null,null,"Paralelo:",null,null,null,null,null,null,null,null,null,null,null,null,null,null,null,"AÑO DE ESCOLARIDAD",null,"CUARTO"]
[null,null,"Distrito Educativo:",null,null,null,null,null,null,null,null,null,null,null,null,null,null,null,"PARALELO",null,"ROJO"]
[null,null,"Red/Núcleo:"]
[null,null,"Dependencia:"]
[null,null,"Código SIE:",null,null,null,null,null,null,null,null,null,null,null,null,null,null,null,"DIRECTOR(A): ",null,"ENRIQUE VILLAFÁN A."]
[null,null,"Directora (or):",null,null,null,null,null,null,null,null,null,null,null,null,null,null,null,"MAESTRA (O)",null,"ELIAS CARLOS HIDALGO M."]
[null,null,"Maestra (o):",null,null,null,null,null,null,null,null,null,null,null,null,null,null,null,"GESTION ",null,2018]
[null,null,"Año de Escolaridad:"]
[null,null,"Teléfono ó Celular:     "]
[]
[]
[]
[null,null,"GESTIÓN  ",null,null,2019]

{"sheet":"FILIACION_ESTUDIANTE","index":4,"n_rows":48,"n_cols":29,"rows_kept":48,"cut":false,"hidden":false,"merged":[[48,2,48,3],[1,3,1,14],[4,0,6,0],[4,1,6,3],[4,4,6,4],[4,5,4,15],[5,5,6,5],[5,7,6,7],[5,8,6,8],[5,9,6,9],[5,14,6,14],[5,15,6,15],[5,12,5,13],[5,10,5,11],[5,6,6,6]]}
[]
[null,null,null,"FILIACIÓN  DEL   ESTUDIANTE"]
[null,null,{"$f":"UPPER(CARATULA!$C$12)","v":"UNIDAD EDUCATIVA:"},{"$f":"UPPER(CARATULA!$E$12)","v":""},null,null,null,null,null,null,null,null,null,"GESTIÓN: ",{"$f":"CARATULA!$F$26","v":2019}]
[null,null,{"$f":"UPPER( CARATULA!$C$20)","v":"MAESTRA (O):"},{"$f":"CARATULA!$E$20","v":0},null,null,null,null,null,null,null,null,null,"AÑO DE ESCOLARIDAD:",{"$f":"CARATULA!$E$21","v":0},null,null,null,null,null,null,{"$f":"DATE(CARATULA!F26,6,30)","v":"2019-06-30"}]
["N°","APELLIDOS Y NOMBRES",null,null,"CÓDIGO  RUDE","DATOS DEL ESTUDIANTE",null,null,null,null,null,null,null,null,null,null,null,null,null,null,null,{"$f":"MONTH(44)","v":2},{"$f":"YEAR(V4)","v":2019},null,null,null,"F"]
[null,null,null,null,null,"LUGAR  DE NACIMIENTO","CARNET DE IDENTIDAD","FECHA","EDAD","SEXO","PESO",null,"TALLA",null,"UNIDAD EDUCATIVA O CENTRO INFANTIL INTEGRAL  DE PROCEDENCIA","OBSERVACIÓN",null,null,null,null,null,null,null,null,null,null,"M"]
[null,null,null,null,null,null,null,null,null,null,"INI.","FINAL","INI.","FINAL"]
[1,null,null,null,null,null,null,null,null,null,null,null,null,null,null,null,null,null,null,null,null,{"$f":"MONTH(H8)","v":1},{"$f":"YEAR(H8)","v":1900},{"$f":"IF(V8<=V$5,W$5-W8,(W$5-W8-1))","v":119},{"$f":"N(W8)","v":1900},{"$f":"IF(J8=\"M\",1,0)","v":0},{"$f":"IF(J8=\"F\",1,0)","v":0},{"$f":"IF(Z8=1,X8,0)","v":0},{"$f":"IF(AA8=1,X8,0)","v":0}]
[2,null,null,null,null,null,null,null,null,null,null,null,null,null,null,null,null,null,null,null,null,{"$f":"MONTH(H9)","v":1},{"$f":"YEAR(H9)","v":1900},{"$f":"IF(V9<=V$5,W$5-W9,(W$5-W9-1))","v":119},{"$f":"N(W9)","v":1900},{"$f":"IF(J9=\"M\",1,0)","v":0},{"$f":"IF(J9=\"F\",1,0)","v":0},{"$f":"IF(Z9=1,X9,0)","v":0},{"$f":"IF(AA9=1,X9,0)","v":0}]
[3,null,null,null,null,null,null,null,null,null,null,null,null,null,null,null,null,null,null,null,null,{"$f":"MONTH(H10)","v":1},{"$f":"YEAR(H10)","v":1900},{"$f":"IF(V10<=V$5,W$5-W10,(W$5-W10-1))","v":119},{"$f":"N(W10)","v":1900},{"$f":"IF(J10=\"M\",1,0)","v":0},0,0,0]
[4,null,null,null,null,null,null,null,null,null,null,null,null,null,null,null,null,null,null,null,null,{"$f":"MONTH(H11)","v":1},{"$f":"YEAR(H11)","v":1900},{"$f":"IF(V11<=V$5,W$5-W11,(W$5-W11-1))","v":119},1900,{"$f":"IF(J11=\"M\",1,0)","v":0},0,0,0]
[5,null,null,null,null,null,null,null,null,null,null,null,null,null,null,null,null,null,null,null,null,1,1900,119,1900,{"$f":"IF(J12=\"M\",1,0)","v":0},0,0,0]
[6,null,null,null,null,null,null,null,null,null,null,null,null,null,null,null,null,null,null,null,null,1,1900,119,1900,{"$f":"IF(J13=\"M\",1,0)","v":0},0,0,0]
[7,null,null,null,null,null,null,null,null,null,null,null,null,null,null,null,null,null,null,null,null,1,1900,119,1900,0,0,0,0]
[8,null,null,null,null,null,null,null,null,null,null,null,null,null,null,null,null,null,null,null,null,1,1900,119,1900,0,0,0,0]
[9,null,null,null,null,null,null,null,null,null,null,null,null,null,null,null,null,null,null,null,null,1,1900,119,1900,0,0,0,0]
[10,null,null,null,null,null,null,null,null,null,null,null,null,null,null,null,null,null,null,null,null,1,1900,119,1900,0,0,0,0]
[11,null,null,null,null,null,null,null,null,null,null,null,null,null,null,null,null,null,null,null,null,1,1900,119,1900,0,0,0,0]
[12,null,null,null,null,null,null,null,null,null,null,null,null,null,null,null,null,null,null,null,null,1,1900,119,1900,0,{"$f":"IF(I19=\"F\",1,0)","v":0},0,0]
[13,null,null,null,null,null,null,null,null,null,null,null,null,null,null,null,null,null,null,null,null,1,1900,119,1900,0,0,0,0]
[14,null,null,null,null,null,null,null,null,null,null,null,null,null,null,null,null,null,null,null,null,1,1900,119,1900,0,0,0,0]
[15,null,null,null,null,null,null,null,null,null,null,null,null,null,null,null,null,null,null,null,null,1,1900,119,1900,0,0,0,0]
[16,null,null,null,null,null,null,null,null,null,null,null,null,null,null,null,null,null,null,null,null,1,1900,119,1900,0,0,0,0]
[17,null,null,null,null,null,null,null,null,null,null,null,null,null,null,null,null,null,null,null,null,1,1900,119,1900,0,0,0,0]
[18,null,null,null,null,null,null,null,null,null,null,null,null,null,null,null,null,null,null,null,null,1,1900,119,1900,0,0,0,0]
[19,null,null,null,null,null,null,null,null,null,null,null,null,null,null,null,null,null,null,null,null,1,{"$f":"YEAR(H26)","v":1900},{"$f":"IF(V26<=V$5,W$5-W26,(W$5-W26-1))","v":119},{"$f":"N(W26)","v":1900},0,0,0,0]
[20,null,null,null,null,null,null,null,null,null,null,null,null,null,null,null,null,null,null,null,null,{"$f":"MONTH(H27)","v":1},1900,119,1900,0,0,0,0]
[21,null,null,null,null,null,null,null,null,null,null,null,null,null,null,null,null,null,null,null,null,1,1900,119,1900,0,0,0,0]
[22,null,null,null,null,null,null,null,null,null,null,null,null,null,null,null,null,null,null,null,null,1,1900,119,1900,0,0,0,0]
[23,null,null,null,null,null,null,null,null,null,null,null,null,null,null,null,null,null,null,null,null,1,1900,119,1900,0,0,0,0]
[24,null,null,null,null,null,null,null,null,null,null,null,null,null,null,null,null,null,null,null,null,1,1900,119,1900,0,0,0,0]
[25,null,null,null,null,null,null,null,null,null,null,null,null,null,null,null,null,null,null,null,null,1,1900,119,1900,0,0,0,0]
[26,null,null,null,null,null,null,null,null,null,null,null,null,null,null,null,null,null,null,null,null,1,1900,119,1900,0,0,0,0]
[27,null,null,null,null,null,null,null,null,null,null,null,null,null,null,null,null,null,null,null,null,1,1900,119,1900,0,0,0,0]
[28,null,null,null,null,null,null,null,null,null,null,null,null,null,null,null,null,null,null,null,null,1,1900,119,1900,0,0,0,0]
[29,null,null,null,null,null,null,null,null,null,null,null,null,null,null,null,null,null,null,null,null,1,1900,119,1900,0,0,0,0]
[30,null,null,null,null,null,null,null,null,null,null,null,null,null,null,null,null,null,null,null,null,1,1900,119,1900,0,0,0,0]
[31,null,null,null,null,null,null,null,null,null,null,null,null,null,null,null,null,null,null,null,null,1,1900,119,1900,0,0,0,0]
[32,null,null,null,null,null,null,null,null,null,null,null,null,null,null,null,null,null,null,null,null,1,1900,119,1900,0,0,0,0]
[33,null,null,null,null,null,null,null,null,null,null,null,null,null,null,null,null,null,null,null,null,1,1900,119,1900,0,0,0,0]
[34,null,null,null,null,null,null,null,null,null,null,null,null,null,null,null,null,null,null,null,null,1,1900,119,1900,0,0,0,0]
[35,null,null,null,null,null,null,null,null,null,null,null,null,null,null,null,null,null,null,null,null,1,1900,119,1900,0,0,0,0]
[36,null,null,null,null,null,null,null,null,null,null,null,null,null,null,null,null,null,null,null,null,1,1900,119,1900,0,0,0,0]
[37,null,null,null,null,null,null,null,null,null,null,null,null,null,null,null,null,null,null,null,null,1,1900,119,1900,0,0,0,0]
[38,null,null,null,null,null,null,null,null,null,null,null,null,null,null,null,null,null,null,null,null,1,1900,119,1900,0,0,0,0]
[39,null,null,null,null,null,null,null,null,null,null,null,null,null,null,null,null,null,null,null,null,1,1900,119,1900,0,0,0,0]
[40,null,null,null,null,null,null,null,null,null,null,null,null,null,null,null,null,null,null,null,null,1,1900,119,1900,0,0,0,0]
[null,null,null,null,null,null,null,null,null,null,null,null,null,null,null,null,null,null,null,null,null,null,null,null,null,0]

{"sheet":"FILIACION_PPFF","index":5,"n_rows":46,"n_cols":10,"rows_kept":46,"cut":false,"hidden":false,"merged":[[4,9,5,9],[4,8,5,8],[1,1,1,9],[0,2,0,3],[4,0,5,0],[4,1,5,1],[4,2,4,4],[4,5,4,7]]}
[]
[null,"FILIACIÓN DE LA MADRE - PADRE - TUTOR"]
[null,{"$f":"UPPER(CARATULA!$C$12)","v":"UNIDAD EDUCATIVA:"},{"$f":"UPPER(CARATULA!$E$12)","v":""},null,null,null,null,"GESTIÓN: ",{"$f":"CARATULA!$F$26","v":2019}]
[null,{"$f":"UPPER( CARATULA!$C$20)","v":"MAESTRA (O):"},{"$f":"CARATULA!$E$20","v":0},null,null,null,null,"AÑO DE ESCOLARIDAD:",{"$f":"CARATULA!$E$21","v":0}]
["Nº","APELLIDOS Y NOMBRES/ESTUDIANTE","               DATOS DE LA MADRE O TUTOR",null,null,"DATOS DEL PADRE O TUTOR",null,null,"DIRECCIÓN","OBSERVACIÓN"]
[null,null,"NOMBRE","OCUPACIÓN PROFESIÓN","TELÉFONO","NOMBRE","OCUPACIÓN PROFESIÓN","TELÉFONO"]
[1,{"$f":"CONCATENATE(FILIACION_ESTUDIANTE!B8,\"  \",FILIACION_ESTUDIANTE!C8,\"  \",FILIACION_ESTUDIANTE!D8)","v":"    "}]
[2,{"$f":"CONCATENATE(FILIACION_ESTUDIANTE!B9,\"  \",FILIACION_ESTUDIANTE!C9,\"  \",FILIACION_ESTUDIANTE!D9)","v":"    "}]
[3,{"$f":"CONCATENATE(FILIACION_ESTUDIANTE!B10,\"  \",FILIACION_ESTUDIANTE!C10,\"  \",FILIACION_ESTUDIANTE!D10)","v":"    "}]
[4,{"$f":"CONCATENATE(FILIACION_ESTUDIANTE!B11,\"  \",FILIACION_ESTUDIANTE!C11,\"  \",FILIACION_ESTUDIANTE!D11)","v":"    "}]
[5,{"$f":"CONCATENATE(FILIACION_ESTUDIANTE!B12,\"  \",FILIACION_ESTUDIANTE!C12,\"  \",FILIACION_ESTUDIANTE!D12)","v":"    "}]
[6,{"$f":"CONCATENATE(FILIACION_ESTUDIANTE!B13,\"  \",FILIACION_ESTUDIANTE!C13,\"  \",FILIACION_ESTUDIANTE!D13)","v":"    "}]
[7,{"$f":"CONCATENATE(FILIACION_ESTUDIANTE!B14,\"  \",FILIACION_ESTUDIANTE!C14,\"  \",FILIACION_ESTUDIANTE!D14)","v":"    "}]
[8,{"$f":"CONCATENATE(FILIACION_ESTUDIANTE!B15,\"  \",FILIACION_ESTUDIANTE!C15,\"  \",FILIACION_ESTUDIANTE!D15)","v":"    "}]
[9,{"$f":"CONCATENATE(FILIACION_ESTUDIANTE!B16,\"  \",FILIACION_ESTUDIANTE!C16,\"  \",FILIACION_ESTUDIANTE!D16)","v":"    "}]
[10,{"$f":"CONCATENATE(FILIACION_ESTUDIANTE!B17,\"  \",FILIACION_ESTUDIANTE!C17,\"  \",FILIACION_ESTUDIANTE!D17)","v":"    "}]
[11,{"$f":"CONCATENATE(FILIACION_ESTUDIANTE!B18,\"  \",FILIACION_ESTUDIANTE!C18,\"  \",FILIACION_ESTUDIANTE!D18)","v":"    "}]
[12,{"$f":"CONCATENATE(FILIACION_ESTUDIANTE!B19,\"  \",FILIACION_ESTUDIANTE!C19,\"  \",FILIACION_ESTUDIANTE!D19)","v":"    "}]
[13,{"$f":"CONCATENATE(FILIACION_ESTUDIANTE!B20,\"  \",FILIACION_ESTUDIANTE!C20,\"  \",FILIACION_ESTUDIANTE!D20)","v":"    "}]
[14,{"$f":"CONCATENATE(FILIACION_ESTUDIANTE!B21,\"  \",FILIACION_ESTUDIANTE!C21,\"  \",FILIACION_ESTUDIANTE!D21)","v":"    "}]
[15,{"$f":"CONCATENATE(FILIACION_ESTUDIANTE!B22,\"  \",FILIACION_ESTUDIANTE!C22,\"  \",FILIACION_ESTUDIANTE!D22)","v":"    "}]
[16,{"$f":"CONCATENATE(FILIACION_ESTUDIANTE!B23,\"  \",FILIACION_ESTUDIANTE!C23,\"  \",FILIACION_ESTUDIANTE!D23)","v":"    "}]
[17,{"$f":"CONCATENATE(FILIACION_ESTUDIANTE!B24,\"  \",FILIACION_ESTUDIANTE!C24,\"  \",FILIACION_ESTUDIANTE!D24)","v":"    "}]
[18,{"$f":"CONCATENATE(FILIACION_ESTUDIANTE!B25,\"  \",FILIACION_ESTUDIANTE!C25,\"  \",FILIACION_ESTUDIANTE!D25)","v":"    "}]
[19,{"$f":"CONCATENATE(FILIACION_ESTUDIANTE!B26,\"  \",FILIACION_ESTUDIANTE!C26,\"  \",FILIACION_ESTUDIANTE!D26)","v":"    "}]
[20,{"$f":"CONCATENATE(FILIACION_ESTUDIANTE!B27,\"  \",FILIACION_ESTUDIANTE!C27,\"  \",FILIACION_ESTUDIANTE!D27)","v":"    "}]
[21,{"$f":"CONCATENATE(FILIACION_ESTUDIANTE!B28,\"  \",FILIACION_ESTUDIANTE!C28,\"  \",FILIACION_ESTUDIANTE!D28)","v":"    "}]
[22,{"$f":"CONCATENATE(FILIACION_ESTUDIANTE!B29,\"  \",FILIACION_ESTUDIANTE!C29,\"  \",FILIACION_ESTUDIANTE!D29)","v":"    "}]
[23,{"$f":"CONCATENATE(FILIACION_ESTUDIANTE!B30,\"  \",FILIACION_ESTUDIANTE!C30,\"  \",FILIACION_ESTUDIANTE!D30)","v":"    "}]
[24,{"$f":"CONCATENATE(FILIACION_ESTUDIANTE!B31,\"  \",FILIACION_ESTUDIANTE!C31,\"  \",FILIACION_ESTUDIANTE!D31)","v":"    "}]
[25,{"$f":"CONCATENATE(FILIACION_ESTUDIANTE!B32,\"  \",FILIACION_ESTUDIANTE!C32,\"  \",FILIACION_ESTUDIANTE!D32)","v":"    "}]
[26,{"$f":"CONCATENATE(FILIACION_ESTUDIANTE!B33,\"  \",FILIACION_ESTUDIANTE!C33,\"  \",FILIACION_ESTUDIANTE!D33)","v":"    "}]
[27,{"$f":"CONCATENATE(FILIACION_ESTUDIANTE!B34,\"  \",FILIACION_ESTUDIANTE!C34,\"  \",FILIACION_ESTUDIANTE!D34)","v":"    "}]
[28,{"$f":"CONCATENATE(FILIACION_ESTUDIANTE!B35,\"  \",FILIACION_ESTUDIANTE!C35,\"  \",FILIACION_ESTUDIANTE!D35)","v":"    "}]
[29,{"$f":"CONCATENATE(FILIACION_ESTUDIANTE!B36,\"  \",FILIACION_ESTUDIANTE!C36,\"  \",FILIACION_ESTUDIANTE!D36)","v":"    "}]
[30,{"$f":"CONCATENATE(FILIACION_ESTUDIANTE!B37,\"  \",FILIACION_ESTUDIANTE!C37,\"  \",FILIACION_ESTUDIANTE!D37)","v":"    "}]
[31,{"$f":"CONCATENATE(FILIACION_ESTUDIANTE!B38,\"  \",FILIACION_ESTUDIANTE!C38,\"  \",FILIACION_ESTUDIANTE!D38)","v":"    "}]
[32,{"$f":"CONCATENATE(FILIACION_ESTUDIANTE!B39,\"  \",FILIACION_ESTUDIANTE!C39,\"  \",FILIACION_ESTUDIANTE!D39)","v":"    "}]
[33,{"$f":"CONCATENATE(FILIACION_ESTUDIANTE!B40,\"  \",FILIACION_ESTUDIANTE!C40,\"  \",FILIACION_ESTUDIANTE!D40)","v":"    "}]
[34,{"$f":"CONCATENATE(FILIACION_ESTUDIANTE!B41,\"  \",FILIACION_ESTUDIANTE!C41,\"  \",FILIACION_ESTUDIANTE!D41)","v":"    "}]
[35,{"$f":"CONCATENATE(FILIACION_ESTUDIANTE!B42,\"  \",FILIACION_ESTUDIANTE!C42,\"  \",FILIACION_ESTUDIANTE!D42)","v":"    "}]
[36,{"$f":"CONCATENATE(FILIACION_ESTUDIANTE!B43,\"  \",FILIACION_ESTUDIANTE!C43,\"  \",FILIACION_ESTUDIANTE!D43)","v":"    "}]
[37,{"$f":"CONCATENATE(FILIACION_ESTUDIANTE!B44,\"  \",FILIACION_ESTUDIANTE!C44,\"  \",FILIACION_ESTUDIANTE!D44)","v":"    "}]
[38,{"$f":"CONCATENATE(FILIACION_ESTUDIANTE!B45,\"  \",FILIACION_ESTUDIANTE!C45,\"  \",FILIACION_ESTUDIANTE!D45)","v":"    "}]
[39,{"$f":"CONCATENATE(FILIACION_ESTUDIANTE!B46,\"  \",FILIACION_ESTUDIANTE!C46,\"  \",FILIACION_ESTUDIANTE!D46)","v":"    "}]
[40,{"$f":"CONCATENATE(FILIACION_ESTUDIANTE!B47,\"  \",FILIACION_ESTUDIANTE!C47,\"  \",FILIACION_ESTUDIANTE!D47)","v":"    "}]

{"sheet":"VACUNAS","index":6,"n_rows":47,"n_cols":13,"rows_kept":47,"cut":false,"hidden":false,"merged":[[1,0,1,12],[4,0,6,0],[4,1,6,1],[4,12,6,12],[4,2,4,11],[5,2,6,2],[5,3,5,5],[5,6,5,8],[5,11,6,11],[5,9,6,9],[5,10,6,10]]}
[]
["REGISTRO DE VACUNAS"]
[null,{"$f":"UPPER(CARATULA!$C$12)","v":"UNIDAD EDUCATIVA:"},{"$f":"UPPER(CARATULA!$E$12)","v":""},null,null,null,null,null,null,"GESTIÓN: ",{"$f":"CARATULA!$F$26","v":2019}]
[null,{"$f":"UPPER( CARATULA!$C$20)","v":"MAESTRA (O):"},{"$f":"CARATULA!$E$20","v":0},null,null,null,null,null,null,"AÑO DE ESCOLARIDAD:",{"$f":"CARATULA!$E$21","v":0}]
["Nº","APELLIDOS Y NOMBRES",null,null,null,null,null,null,null,null,null,null,"Observaciones"]
[null,null,"BCG(tuberculusis):única  Recién  Nacido","Antipolio",null,null,"Pentavalente",null,null,"Antiamarilla única          (12 meses)","SRP (MMR): única             (12 a 23 meses)","otras:"]
[null,null,null,"1° (2 meses)","2°(4 meses)","3° (6 meses)","1° (2 meses)","2°(4 meses)","3° (6 meses)"]
[1,{"$f":"CONCATENATE(FILIACION_ESTUDIANTE!B8,\"   \",FILIACION_ESTUDIANTE!C8,\"  \",FILIACION_ESTUDIANTE!D8)","v":"     "}]
[2,{"$f":"CONCATENATE(FILIACION_ESTUDIANTE!B9,\"   \",FILIACION_ESTUDIANTE!C9,\"  \",FILIACION_ESTUDIANTE!D9)","v":"     "}]
[3,{"$f":"CONCATENATE(FILIACION_ESTUDIANTE!B10,\"   \",FILIACION_ESTUDIANTE!C10,\"  \",FILIACION_ESTUDIANTE!D10)","v":"     "}]
[4,{"$f":"CONCATENATE(FILIACION_ESTUDIANTE!B11,\"   \",FILIACION_ESTUDIANTE!C11,\"  \",FILIACION_ESTUDIANTE!D11)","v":"     "}]
[5,{"$f":"CONCATENATE(FILIACION_ESTUDIANTE!B12,\"   \",FILIACION_ESTUDIANTE!C12,\"  \",FILIACION_ESTUDIANTE!D12)","v":"     "}]
[6,{"$f":"CONCATENATE(FILIACION_ESTUDIANTE!B13,\"   \",FILIACION_ESTUDIANTE!C13,\"  \",FILIACION_ESTUDIANTE!D13)","v":"     "}]
[7,{"$f":"CONCATENATE(FILIACION_ESTUDIANTE!B14,\"   \",FILIACION_ESTUDIANTE!C14,\"  \",FILIACION_ESTUDIANTE!D14)","v":"     "}]
[8,{"$f":"CONCATENATE(FILIACION_ESTUDIANTE!B15,\"   \",FILIACION_ESTUDIANTE!C15,\"  \",FILIACION_ESTUDIANTE!D15)","v":"     "}]
[9,{"$f":"CONCATENATE(FILIACION_ESTUDIANTE!B16,\"   \",FILIACION_ESTUDIANTE!C16,\"  \",FILIACION_ESTUDIANTE!D16)","v":"     "}]
[10,{"$f":"CONCATENATE(FILIACION_ESTUDIANTE!B17,\"   \",FILIACION_ESTUDIANTE!C17,\"  \",FILIACION_ESTUDIANTE!D17)","v":"     "}]
[11,{"$f":"CONCATENATE(FILIACION_ESTUDIANTE!B18,\"   \",FILIACION_ESTUDIANTE!C18,\"  \",FILIACION_ESTUDIANTE!D18)","v":"     "}]
[12,{"$f":"CONCATENATE(FILIACION_ESTUDIANTE!B19,\"   \",FILIACION_ESTUDIANTE!C19,\"  \",FILIACION_ESTUDIANTE!D19)","v":"     "}]
[13,{"$f":"CONCATENATE(FILIACION_ESTUDIANTE!B20,\"   \",FILIACION_ESTUDIANTE!C20,\"  \",FILIACION_ESTUDIANTE!D20)","v":"     "}]
[14,{"$f":"CONCATENATE(FILIACION_ESTUDIANTE!B21,\"   \",FILIACION_ESTUDIANTE!C21,\"  \",FILIACION_ESTUDIANTE!D21)","v":"     "}]
[15,{"$f":"CONCATENATE(FILIACION_ESTUDIANTE!B22,\"   \",FILIACION_ESTUDIANTE!C22,\"  \",FILIACION_ESTUDIANTE!D22)","v":"     "}]
[16,{"$f":"CONCATENATE(FILIACION_ESTUDIANTE!B23,\"   \",FILIACION_ESTUDIANTE!C23,\"  \",FILIACION_ESTUDIANTE!D23)","v":"     "}]
[17,{"$f":"CONCATENATE(FILIACION_ESTUDIANTE!B24,\"   \",FILIACION_ESTUDIANTE!C24,\"  \",FILIACION_ESTUDIANTE!D24)","v":"     "}]
[18,{"$f":"CONCATENATE(FILIACION_ESTUDIANTE!B25,\"   \",FILIACION_ESTUDIANTE!C25,\"  \",FILIACION_ESTUDIANTE!D25)","v":"     "}]
[19,{"$f":"CONCATENATE(FILIACION_ESTUDIANTE!B26,\"   \",FILIACION_ESTUDIANTE!C26,\"  \",FILIACION_ESTUDIANTE!D26)","v":"     "}]
[20,{"$f":"CONCATENATE(FILIACION_ESTUDIANTE!B27,\"   \",FILIACION_ESTUDIANTE!C27,\"  \",FILIACION_ESTUDIANTE!D27)","v":"     "}]
[21,{"$f":"CONCATENATE(FILIACION_ESTUDIANTE!B28,\"   \",FILIACION_ESTUDIANTE!C28,\"  \",FILIACION_ESTUDIANTE!D28)","v":"     "}]
[22,{"$f":"CONCATENATE(FILIACION_ESTUDIANTE!B29,\"   \",FILIACION_ESTUDIANTE!C29,\"  \",FILIACION_ESTUDIANTE!D29)","v":"     "}]
[23,{"$f":"CONCATENATE(FILIACION_ESTUDIANTE!B30,\"   \",FILIACION_ESTUDIANTE!C30,\"  \",FILIACION_ESTUDIANTE!D30)","v":"     "},null,null,null,null,null,null,null,null,"           "]
[24,{"$f":"CONCATENATE(FILIACION_ESTUDIANTE!B31,\"   \",FILIACION_ESTUDIANTE!C31,\"  \",FILIACION_ESTUDIANTE!D31)","v":"     "}]
[25,{"$f":"CONCATENATE(FILIACION_ESTUDIANTE!B32,\"   \",FILIACION_ESTUDIANTE!C32,\"  \",FILIACION_ESTUDIANTE!D32)","v":"     "}]
[26,{"$f":"CONCATENATE(FILIACION_ESTUDIANTE!B33,\"   \",FILIACION_ESTUDIANTE!C33,\"  \",FILIACION_ESTUDIANTE!D33)","v":"     "}]
[27,{"$f":"CONCATENATE(FILIACION_ESTUDIANTE!B34,\"   \",FILIACION_ESTUDIANTE!C34,\"  \",FILIACION_ESTUDIANTE!D34)","v":"     "}]
[28,{"$f":"CONCATENATE(FILIACION_ESTUDIANTE!B35,\"   \",FILIACION_ESTUDIANTE!C35,\"  \",FILIACION_ESTUDIANTE!D35)","v":"     "}]
[29,{"$f":"CONCATENATE(FILIACION_ESTUDIANTE!B36,\"   \",FILIACION_ESTUDIANTE!C36,\"  \",FILIACION_ESTUDIANTE!D36)","v":"     "}]
[30,{"$f":"CONCATENATE(FILIACION_ESTUDIANTE!B37,\"   \",FILIACION_ESTUDIANTE!C37,\"  \",FILIACION_ESTUDIANTE!D37)","v":"     "}]
[31,{"$f":"CONCATENATE(FILIACION_ESTUDIANTE!B38,\"   \",FILIACION_ESTUDIANTE!C38,\"  \",FILIACION_ESTUDIANTE!D38)","v":"     "}]
[32,{"$f":"CONCATENATE(FILIACION_ESTUDIANTE!B39,\"   \",FILIACION_ESTUDIANTE!C39,\"  \",FILIACION_ESTUDIANTE!D39)","v":"     "}]
[33,{"$f":"CONCATENATE(FILIACION_ESTUDIANTE!B40,\"   \",FILIACION_ESTUDIANTE!C40,\"  \",FILIACION_ESTUDIANTE!D40)","v":"     "}]
[34,{"$f":"CONCATENATE(FILIACION_ESTUDIANTE!B41,\"   \",FILIACION_ESTUDIANTE!C41,\"  \",FILIACION_ESTUDIANTE!D41)","v":"     "}]
[35,{"$f":"CONCATENATE(FILIACION_ESTUDIANTE!B42,\"   \",FILIACION_ESTUDIANTE!C42,\"  \",FILIACION_ESTUDIANTE!D42)","v":"     "}]
[36,{"$f":"CONCATENATE(FILIACION_ESTUDIANTE!B43,\"   \",FILIACION_ESTUDIANTE!C43,\"  \",FILIACION_ESTUDIANTE!D43)","v":"     "}]
[37,{"$f":"CONCATENATE(FILIACION_ESTUDIANTE!B44,\"   \",FILIACION_ESTUDIANTE!C44,\"  \",FILIACION_ESTUDIANTE!D44)","v":"     "}]
[38,{"$f":"CONCATENATE(FILIACION_ESTUDIANTE!B45,\"   \",FILIACION_ESTUDIANTE!C45,\"  \",FILIACION_ESTUDIANTE!D45)","v":"     "}]
[39,{"$f":"CONCATENATE(FILIACION_ESTUDIANTE!B46,\"   \",FILIACION_ESTUDIANTE!C46,\"  \",FILIACION_ESTUDIANTE!D46)","v":"     "}]
[40,{"$f":"CONCATENATE(FILIACION_ESTUDIANTE!B47,\"   \",FILIACION_ESTUDIANTE!C47,\"  \",FILIACION_ESTUDIANTE!D47)","v":"     "}]

{"sheet":"ESTADISTICA_EDADES","index":7,"n_rows":51,"n_cols":29,"rows_kept":51,"cut":false,"hidden":false,"merged":[[28,5,28,7],[28,3,28,4],[29,3,29,4],[29,5,29,7],[0,0,0,7],[1,0,1,7],[2,0,2,7]]}
[{"$f":"UPPER(CONCATENATE(CARATULA!C12,\" \",CARATULA!E12))","v":"UNIDAD EDUCATIVA: "}]
[]
["CUADRO DE EDADES"]
[]
[]
[]
[]
[null,null,null,null,null,null,null,null,null,null,null,null,null,null,null,null,null,null,null,null,null,null,null,null,null,null,null,{"$f":"FILIACION_ESTUDIANTE!AB8","v":0},{"$f":"FILIACION_ESTUDIANTE!AC8","v":0}]
[null,null,null,null,null,null,null,null,null,null,null,null,null,null,null,null,null,null,null,null,null,null,null,null,null,null,null,{"$f":"FILIACION_ESTUDIANTE!AB9","v":0},{"$f":"FILIACION_ESTUDIANTE!AC9","v":0}]
[null,null,null,null,null,null,null,null,null,null,null,null,null,null,null,null,null,null,null,null,null,null,null,null,null,null,null,{"$f":"FILIACION_ESTUDIANTE!AB10","v":0},{"$f":"FILIACION_ESTUDIANTE!AC10","v":0}]
[null,null,null,null,null,null,null,null,null,null,null,null,null,null,null,null,null,null,null,null,null,null,null,null,null,null,null,{"$f":"FILIACION_ESTUDIANTE!AB11","v":0},{"$f":"FILIACION_ESTUDIANTE!AC11","v":0}]
[null,null,null,null,null,null,null,null,null,null,null,null,null,null,null,null,null,null,null,null,null,null,null,null,null,null,null,{"$f":"FILIACION_ESTUDIANTE!AB12","v":0},{"$f":"FILIACION_ESTUDIANTE!AC12","v":0}]
[null,null,null,null,null,null,null,null,null,null,null,null,null,null,null,null,null,null,null,null,null,null,null,null,null,null,null,{"$f":"FILIACION_ESTUDIANTE!AB13","v":0},{"$f":"FILIACION_ESTUDIANTE!AC13","v":0}]
[null,null,null,null,null,null,null,null,null,null,null,null,null,null,null,null,null,null,null,null,null,null,null,null,null,null,null,{"$f":"FILIACION_ESTUDIANTE!AB14","v":0},{"$f":"FILIACION_ESTUDIANTE!AC14","v":0}]
[null,null,null,null,null,null,null,null,null,null,null,null,null,null,null,null,null,null,null,null,null,null,null,null,null,null,null,{"$f":"FILIACION_ESTUDIANTE!AB15","v":0},{"$f":"FILIACION_ESTUDIANTE!AC15","v":0}]
[null,null,null,null,null,null,null,null,null,null,null,null,null,null,null,null,null,null,null,null,null,null,null,null,null,null,null,{"$f":"FILIACION_ESTUDIANTE!AB16","v":0},{"$f":"FILIACION_ESTUDIANTE!AC16","v":0}]
[null,null,null,null,null,null,null,null,null,null,null,null,null,null,null,null,null,null,null,null,null,null,null,null,null,null,null,{"$f":"FILIACION_ESTUDIANTE!AB17","v":0},{"$f":"FILIACION_ESTUDIANTE!AC17","v":0}]
[null,null,null,null,null,null,null,null,null,null,null,null,null,null,null,null,null,null,null,null,null,null,null,null,null,null,null,{"$f":"FILIACION_ESTUDIANTE!AB18","v":0},{"$f":"FILIACION_ESTUDIANTE!AC18","v":0}]
[null,null,null,null,null,null,null,null,null,null,null,null,null,null,null,null,null,null,null,null,null,null,null,null,null,null,null,{"$f":"FILIACION_ESTUDIANTE!AB19","v":0},{"$f":"FILIACION_ESTUDIANTE!AC19","v":0}]
[null,null,null,null,null,null,null,null,null,null,null,null,null,null,null,null,null,null,null,null,null,null,null,null,null,null,null,{"$f":"FILIACION_ESTUDIANTE!AB20","v":0},{"$f":"FILIACION_ESTUDIANTE!AC20","v":0}]
[null,null,null,null,null,null,null,null,null,null,null,null,null,null,null,null,null,null,null,null,null,null,null,null,null,null,null,{"$f":"FILIACION_ESTUDIANTE!AB21","v":0},{"$f":"FILIACION_ESTUDIANTE!AC21","v":0}]
[null,null,null,null,null,null,null,null,null,null,null,null,null,null,null,null,null,null,null,null,null,null,null,null,null,null,null,{"$f":"FILIACION_ESTUDIANTE!AB22","v":0},{"$f":"FILIACION_ESTUDIANTE!AC22","v":0}]
[null,null,null,null,null,null,null,null,null,null,null,null,null,null,null,null,null,null,null,null,null,null,null,null,null,null,null,{"$f":"FILIACION_ESTUDIANTE!AB23","v":0},{"$f":"FILIACION_ESTUDIANTE!AC23","v":0}]
[null,null,3,4,5,6,null,null,null,null,null,null,null,null,null,null,null,null,null,null,null,null,null,null,null,null,null,{"$f":"FILIACION_ESTUDIANTE!AB24","v":0},{"$f":"FILIACION_ESTUDIANTE!AC24","v":0}]
[null,"AÑOS","3 AÑOS","4 AÑOS","5 AÑOS","6 AÑOS","TOTAL",null,null,null,null,null,null,null,null,null,null,null,null,null,null,null,null,null,null,null,null,{"$f":"FILIACION_ESTUDIANTE!AB25","v":0},{"$f":"FILIACION_ESTUDIANTE!AC25","v":0}]
[null,"VARONES",{"$f":"COUNTIFS(FILIACION_ESTUDIANTE!I8:I47,3,FILIACION_ESTUDIANTE!J8:J47,\"M\")","v":0},{"$f":"COUNTIFS(FILIACION_ESTUDIANTE!I8:I47,4,FILIACION_ESTUDIANTE!J8:J47,\"M\")","v":0},{"$f":"COUNTIFS(FILIACION_ESTUDIANTE!I8:I47,5,FILIACION_ESTUDIANTE!J8:J47,\"M\")","v":0},{"$f":"COUNTIFS(FILIACION_ESTUDIANTE!I8:I47,6,FILIACION_ESTUDIANTE!J8:J47,\"M\")","v":0},{"$f":"SUM(C26:F26)","v":0},null,null,null,null,null,null,null,null,null,null,null,null,null,null,null,null,null,null,null,null,{"$f":"FILIACION_ESTUDIANTE!AB26","v":0},{"$f":"FILIACION_ESTUDIANTE!AC26","v":0}]
[null,"MUJERES",{"$f":"COUNTIFS(FILIACION_ESTUDIANTE!I8:I47,3,FILIACION_ESTUDIANTE!J8:J47,\"F\")","v":0},{"$f":"COUNTIFS(FILIACION_ESTUDIANTE!I8:I47,4,FILIACION_ESTUDIANTE!J8:J47,\"F\")","v":0},{"$f":"COUNTIFS(FILIACION_ESTUDIANTE!I8:I47,5,FILIACION_ESTUDIANTE!J8:J47,\"F\")","v":0},{"$f":"COUNTIFS(FILIACION_ESTUDIANTE!I8:I47,6,FILIACION_ESTUDIANTE!J8:J47,\"F\")","v":0},{"$f":"SUM(C27:F27)","v":0},null,null,null,null,null,null,null,null,null,null,null,null,null,null,null,null,null,null,null,null,{"$f":"FILIACION_ESTUDIANTE!AB27","v":0},{"$f":"FILIACION_ESTUDIANTE!AC27","v":0}]
[null,"TOTAL",{"$f":"SUM(C26:C27)","v":0},{"$f":"SUM(D26:D27)","v":0},{"$f":"SUM(E26:E27)","v":0},{"$f":"SUM(F26:F27)","v":0},{"$f":"SUM(G26:G27)","v":0},null,null,null,null,null,null,null,null,null,null,null,null,null,null,null,null,null,null,null,null,{"$f":"FILIACION_ESTUDIANTE!AB28","v":0},{"$f":"FILIACION_ESTUDIANTE!AC28","v":0}]
[null,null,null,"MAESTRA(O):",null,{"$f":"UPPER(CARATULA!E20)","v":""},null,null,null,null,null,null,null,null,null,null,null,null,null,null,null,null,null,null,null,null,null,{"$f":"FILIACION_ESTUDIANTE!AB29","v":0},{"$f":"FILIACION_ESTUDIANTE!AC29","v":0}]
[null,null,null,"AÑO DE ESCOLARIDAD",null,{"$f":"UPPER(CARATULA!E21)","v":""},null,null,null,null,null,null,null,null,null,null,null,null,null,null,null,null,null,null,null,null,null,{"$f":"FILIACION_ESTUDIANTE!AB30","v":0},{"$f":"FILIACION_ESTUDIANTE!AC30","v":0}]
[null,null,null,null,null,null,null,null,null,null,null,null,null,null,null,null,null,null,null,null,null,null,null,null,null,null,null,{"$f":"FILIACION_ESTUDIANTE!AB31","v":0},{"$f":"FILIACION_ESTUDIANTE!AC31","v":0}]
[null,null,null,null,null,null,null,null,null,null,null,null,null,null,null,null,null,null,null,null,null,null,null,null,null,null,null,{"$f":"FILIACION_ESTUDIANTE!AB32","v":0},{"$f":"FILIACION_ESTUDIANTE!AC32","v":0}]
[null,"* Años cumplidos al 30 de junio",null,null,null,null,null,null,null,null,null,null,null,null,null,null,null,null,null,null,null,null,null,null,null,null,null,{"$f":"FILIACION_ESTUDIANTE!AB33","v":0},{"$f":"FILIACION_ESTUDIANTE!AC33","v":0}]
[null,null,null,null,null,null,null,null,null,null,null,null,null,null,null,null,null,null,null,null,null,null,null,null,null,null,null,{"$f":"FILIACION_ESTUDIANTE!AB34","v":0},{"$f":"FILIACION_ESTUDIANTE!AC34","v":0}]
[null,null,null,null,null,null,null,null,null,null,null,null,null,null,null,null,null,null,null,null,null,null,null,null,null,null,null,{"$f":"FILIACION_ESTUDIANTE!AB35","v":0},{"$f":"FILIACION_ESTUDIANTE!AC35","v":0}]
[null,null,null,null,null,null,null,null,null,null,null,null,null,null,null,null,null,null,null,null,null,null,null,null,null,null,null,{"$f":"FILIACION_ESTUDIANTE!AB36","v":0},{"$f":"FILIACION_ESTUDIANTE!AC36","v":0}]
[null,null,null,null,null,null,null,null,null,null,null,null,null,null,null,null,null,null,null,null,null,null,null,null,null,null,null,{"$f":"FILIACION_ESTUDIANTE!AB37","v":0},{"$f":"FILIACION_ESTUDIANTE!AC37","v":0}]
[null,null,null,null,null,null,null,null,null,null,null,null,null,null,null,null,null,null,null,null,null,null,null,null,null,null,null,{"$f":"FILIACION_ESTUDIANTE!AB38","v":0},{"$f":"FILIACION_ESTUDIANTE!AC38","v":0}]
[null,null,null,null,null,null,null,null,null,null,null,null,null,null,null,null,null,null,null,null,null,null,null,null,null,null,null,{"$f":"FILIACION_ESTUDIANTE!AB39","v":0},{"$f":"FILIACION_ESTUDIANTE!AC39","v":0}]
[null,null,null,null,null,null,null,null,null,null,null,null,null,null,null,null,null,null,null,null,null,null,null,null,null,null,null,{"$f":"FILIACION_ESTUDIANTE!AB40","v":0},{"$f":"FILIACION_ESTUDIANTE!AC40","v":0}]
[null,null,null,null,null,null,null,null,null,null,null,null,null,null,null,null,null,null,null,null,null,null,null,null,null,null,null,{"$f":"FILIACION_ESTUDIANTE!AB41","v":0},{"$f":"FILIACION_ESTUDIANTE!AC41","v":0}]
[null,null,null,null,null,null,null,null,null,null,null,null,null,null,null,null,null,null,null,null,null,null,null,null,null,null,null,{"$f":"FILIACION_ESTUDIANTE!AB42","v":0},{"$f":"FILIACION_ESTUDIANTE!AC42","v":0}]
[null,null,null,null,null,null,null,null,null,null,null,null,null,null,null,null,null,null,null,null,null,null,null,null,null,null,null,{"$f":"FILIACION_ESTUDIANTE!AB43","v":0},{"$f":"FILIACION_ESTUDIANTE!AC43","v":0}]
[null,null,null,null,null,null,null,null,null,null,null,null,null,null,null,null,null,null,null,null,null,null,null,null,null,null,null,{"$f":"FILIACION_ESTUDIANTE!AB44","v":0},{"$f":"FILIACION_ESTUDIANTE!AC44","v":0}]
[null,null,null,null,null,null,null,null,null,null,null,null,null,null,null,null,null,null,null,null,null,null,null,null,null,null,null,{"$f":"FILIACION_ESTUDIANTE!AB45","v":0},{"$f":"FILIACION_ESTUDIANTE!AC45","v":0}]
[null,null,null,null,null,null,null,null,null,null,null,null,null,null,null,null,null,null,null,null,null,null,null,null,null,null,null,{"$f":"FILIACION_ESTUDIANTE!AB46","v":0},{"$f":"FILIACION_ESTUDIANTE!AC46","v":0}]
[null,null,null,null,null,null,null,null,null,null,null,null,null,null,null,null,null,null,null,null,null,null,null,null,null,null,null,{"$f":"FILIACION_ESTUDIANTE!AB47","v":0},{"$f":"FILIACION_ESTUDIANTE!AC47","v":0}]
[null,null,null,null,null,null,null,null,null,null,null,null,null,null,null,null,null,null,null,null,null,null,null,null,null,null,null,{"$f":"FILIACION_ESTUDIANTE!#REF!","v":{"$error":"#REF!"}},{"$f":"FILIACION_ESTUDIANTE!#REF!","v":{"$error":"#REF!"}}]
[null,null,null,null,null,null,null,null,null,null,null,null,null,null,null,null,null,null,null,null,null,null,null,null,null,null,null,{"$f":"FILIACION_ESTUDIANTE!#REF!","v":{"$error":"#REF!"}},{"$f":"FILIACION_ESTUDIANTE!#REF!","v":{"$error":"#REF!"}}]
[null,null,null,null,null,null,null,null,null,null,null,null,null,null,null,null,null,null,null,null,null,null,null,null,null,null,null,{"$f":"FILIACION_ESTUDIANTE!#REF!","v":{"$error":"#REF!"}},{"$f":"FILIACION_ESTUDIANTE!#REF!","v":{"$error":"#REF!"}}]
[null,null,null,null,null,null,null,null,null,null,null,null,null,null,null,null,null,null,null,null,null,null,null,null,null,null,null,{"$f":"FILIACION_ESTUDIANTE!#REF!","v":{"$error":"#REF!"}},{"$f":"FILIACION_ESTUDIANTE!#REF!","v":{"$error":"#REF!"}}]

{"sheet":"ASISTENCIA","index":8,"n_rows":0,"n_cols":0,"rows_kept":0,"cut":false,"hidden":false,"merged":[]}

{"sheet":"FEBRERO","index":9,"n_rows":55,"n_cols":54,"rows_kept":55,"cut":false,"hidden":false,"merged":[[48,30,48,31],[54,22,54,26],[54,27,54,29],[50,31,50,32],[57,15,57,21],[57,22,57,26],[57,27,57,29],[6,0,7,0],[6,1,7,3],[6,28,7,28],[6,29,7,29],[8,1,8,4],[6,32,7,32],[6,30,7,30],[51,22,51,26],[52,4,52,7],[50,8,50,11],[50,4,50,7],[51,4,51,7],[53,4,53,7],[53,8,53,11],[48,24,48,27],[17,1,17,4],[55,19,55,21],[0,34,0,35],[1,0,1,32],[2,0,2,32],[3,0,3,2],[3,3,3,12],[3,28,3,32],[3,24,3,27],[0,0,0,32],[4,3,4,32],[25,38,25,40],[26,1,26,4],[26,38,26,40],[5,0,5,32],[6,31,7,31],[8,34,47,34],[14,1,14,4],[15,1,15,4],[37,1,37,4],[24,1,24,4],[31,1,31,4],[28,1,28,4],[13,1,13,4],[9,1,9,4],[10,1,10,4],[11,1,11,4],[12,1,12,4],[47,1,47,4],[40,1,40,4],[30,1,30,4],[46,1,46,4],[24,38,24,40],[16,38,18,40],[19,1,19,4],[19,38,19,40],[20,1,20,4],[20,38,20,40],[23,1,23,4],[16,1,16,4],[21,1,21,4],[21,38,21,40],[22,1,22,4],[22,38,22,40],[23,38,23,40],[18,1,18,4],[48,34,57,34],[50,22,50,26],[50,27,50,29],[27,38,27,40],[27,1,27,4],[25,1,25,4],[44,1,44,4],[45,1,45,4],[53,27,53,29],[53,1,53,2],[28,38,28,40],[29,1,29,4],[39,1,39,4],[41,1,41,4],[32,1,32,4],[33,1,33,4],[34,1,34,4],[35,1,35,4],[36,1,36,4],[38,1,38,4],[42,1,42,4],[43,1,43,4],[53,22,53,26],[29,38,29,40],[56,19,56,21],[51,27,51,29],[52,22,52,26],[52,27,52,29],[52,8,52,11],[51,8,51,11],[51,19,51,21],[52,19,52,21],[53,19,53,21]]}
[null,null,null,null,null,null,null,null,null,null,null,null,null,null,null,null,null,null,null,null,null,null,null,null,null,null,null,null,null,null,null,null,null,null,"ASISTENCIAS E INASISTENCIAS",null,"AZUL"]
[null,null,null,null,null,null,null,null,null,null,null,null,null,null,null,null,null,null,null,null,null,null,null,null,null,null,null,null,null,null,null,null,null,null,"Presente","P"]
[{"$f":"AM20","v":"REGISTRO DE ASISTENCIA FEBRERO  2019"},null,null,null,null,null,null,null,null,null,null,null,null,null,null,null,null,null,null,null,null,null,null,null,null,null,null,null,null,null,null,null,null,null,"Atraso","A"]
[{"$f":"+UPPER(CARATULA!C20)","v":"MAESTRA (O):"},null,null,{"$f":"CARATULA!E20","v":0},null,null,null,null,null,null,null,null,null,null,null,null,null,null,null,null,null,null,null,null,"TURNO: ",null,null,null,{"$f":"CARATULA!E13","v":0},null,null,null,null,null,"falta con licencia","F"]
["PARALELO:",null,null,{"$f":"CARATULA!E14","v":0},null,null,null,null,null,null,null,null,null,null,null,null,null,null,null,null,null,null,null,null,null,null,null,null,null,null,null,null,null,null,"Falta sin licencia","L"]
[{"$f":"+CONCATENATE(\"AÑO DE ESCOLARIDAD:  \",CARATULA!E21)","v":"AÑO DE ESCOLARIDAD:  "}]
["Nº","NÓMINA",null,null,"DÍA","L","M","M","J","V","L","M","M","J","V","L","M","M","J","V","L",{"$f":"IF(F8=7,\"\",\"M\")","v":"M"},{"$f":"IF(V8>27,\"\",\"M\")","v":"M"},{"$f":"IF(W8>27,\"\",\"J\")","v":"J"},{"$f":"IF(X8>27,\"\",\"V\")","v":""},null,null,null,"LICENCIA (L)","FALTA (F)","ATRASO (A)","PRESENTE (P)","DÍAS TRABAJADOS",null,"dias materias tecnicas",0]
[null,null,null,null,"FECHA",4,{"$f":"F8+1","v":5},{"$f":"G8+1","v":6},{"$f":"H8+1","v":7},{"$f":"I8+1","v":8},{"$f":"J8+3","v":11},{"$f":"K8+1","v":12},{"$f":"L8+1","v":13},{"$f":"M8+1","v":14},{"$f":"N8+1","v":15},{"$f":"O8+3","v":18},{"$f":"P8+1","v":19},{"$f":"Q8+1","v":20},{"$f":"R8+1","v":21},{"$f":"S8+1","v":22},{"$f":"T8+3","v":25},{"$f":"IF(F8=7,\"\",U8+1)","v":26},{"$f":"IF(V8>27,\"\",V8+1)","v":27},{"$f":"IF(W8>27,\"\",W8+1)","v":28},{"$f":"IF(X8>27,\"\",X8+1)","v":""},null,null,{"$f":"IF($AI$9=\"FEBRERO\",\"\",AA8+1)","v":""}]
[1,{"$f":"CONCATENATE(FILIACION_ESTUDIANTE!B8,\"  \",FILIACION_ESTUDIANTE!C8,\"  \",FILIACION_ESTUDIANTE!D8)","v":"    "},null,null,null,null,null,null,null,null,null,null,null,null,null,null,null,null,null,null,null,null,null,null,null,null,null,null,{"$f":"COUNTIF((F9:AB9),\"L\")","v":0},{"$f":"COUNTIF((F9:AB9),\"F\")","v":0},{"$f":"COUNTIF((F9:AB9),\"A\")","v":0},{"$f":"COUNTIF((F9:AB9),\"P\")","v":0},{"$f":"ROUND(SUM(AC9:AF9),)","v":0},null,"FEBRERO"]
[2,{"$f":"CONCATENATE(FILIACION_ESTUDIANTE!B9,\"  \",FILIACION_ESTUDIANTE!C9,\"  \",FILIACION_ESTUDIANTE!D9)","v":"    "},null,null,null,null,null,null,null,null,null,null,null,null,null,null,null,null,null,null,null,null,null,null,null,null,null,null,{"$f":"COUNTIF((F10:AB10),\"L\")","v":0},{"$f":"COUNTIF((F10:AB10),\"F\")","v":0},{"$f":"COUNTIF((F10:AB10),\"A\")","v":0},{"$f":"COUNTIF((F10:AB10),\"P\")","v":0},0]
[3,{"$f":"CONCATENATE(FILIACION_ESTUDIANTE!B10,\"  \",FILIACION_ESTUDIANTE!C10,\"  \",FILIACION_ESTUDIANTE!D10)","v":"    "},null,null,null,null,null,null,null,null,null,null,null,null,null,null,null,null,null,null,null,null,null,null,null,null,null,null,0,0,0,0,0]
[4,{"$f":"CONCATENATE(FILIACION_ESTUDIANTE!B11,\"  \",FILIACION_ESTUDIANTE!C11,\"  \",FILIACION_ESTUDIANTE!D11)","v":"    "},null,null,null,null,null,null,null,null,null,null,null,null,null,null,null,null,null,null,null,null,null,null,null,null,null,null,0,0,0,0,0,null,null,null,null,null,null,null,null,null,null,null,null,null,null,null,null,null,null,null,{"$f":"ISLOGICAL((#REF!))","v":false},1]
[5,{"$f":"CONCATENATE(FILIACION_ESTUDIANTE!B12,\"  \",FILIACION_ESTUDIANTE!C12,\"  \",FILIACION_ESTUDIANTE!D12)","v":"    "},null,null,null,null,null,null,null,null,null,null,null,null,null,null,null,null,null,null,null,null,null,null,null,null,null,null,0,0,0,0,0,null,null,null,null,null,null,null,null,null,null,null,null,null,null,null,null,null,null,null,null,"A"]
[6,{"$f":"CONCATENATE(FILIACION_ESTUDIANTE!B13,\"  \",FILIACION_ESTUDIANTE!C13,\"  \",FILIACION_ESTUDIANTE!D13)","v":"    "},null,null,null,null,null,null,null,null,null,null,null,null,null,null,null,null,null,null,null,null,null,null,null,null,null,null,0,0,0,0,0,null,null,null,null,null,null,null,null,null,null,null,null,null,null,null,null,null,null,{"$f":"ISTEXT(#REF!)","v":false}]
[7,{"$f":"CONCATENATE(FILIACION_ESTUDIANTE!B14,\"  \",FILIACION_ESTUDIANTE!C14,\"  \",FILIACION_ESTUDIANTE!D14)","v":"    "},null,null,null,null,null,null,null,null,null,null,null,null,null,null,null,null,null,null,null,null,null,null,null,null,null,null,0,0,0,0,0,null,null,null,null,null,null,null,null,null,null,null,null,null,null,null,null,null,null,null,null,"a"]
[8,{"$f":"CONCATENATE(FILIACION_ESTUDIANTE!B15,\"  \",FILIACION_ESTUDIANTE!C15,\"  \",FILIACION_ESTUDIANTE!D15)","v":"    "},null,null,null,null,null,null,null,null,null,null,null,null,null,null,null,null,null,null,null,null,null,null,null,null,null,null,0,0,0,0,0,null,null,null,null,null,null,null,null,null,null,null,null,null,null,null,null,null,null,null,null,"a"]
[9,{"$f":"CONCATENATE(FILIACION_ESTUDIANTE!B16,\"  \",FILIACION_ESTUDIANTE!C16,\"  \",FILIACION_ESTUDIANTE!D16)","v":"    "},null,null,null,null,null,null,null,null,null,null,null,null,null,null,null,null,null,null,null,null,null,null,null,null,null,null,0,0,0,0,0,null,null,null,null,null,"ENCABEZADO DE LOS FORMULARIOS DE CONTROL DE ASISTENCIA",null,null,null,null,null,null,null,null,null,null,null,{"$f":"MONTH(AY18)","v":2},null,null,"f"]
[10,{"$f":"CONCATENATE(FILIACION_ESTUDIANTE!B17,\"  \",FILIACION_ESTUDIANTE!C17,\"  \",FILIACION_ESTUDIANTE!D17)","v":"    "},null,null,null,null,null,null,null,null,null,null,null,null,null,null,null,null,null,null,null,null,null,null,null,null,null,null,0,0,0,0,0,null,null,null,null,null,null,null,null,null,null,null,null,null,null,null,null,null,"2010-02-01",null,null,"f"]
[11,{"$f":"CONCATENATE(FILIACION_ESTUDIANTE!B18,\"  \",FILIACION_ESTUDIANTE!C18,\"  \",FILIACION_ESTUDIANTE!D18)","v":"    "},null,null,null,null,null,null,null,null,null,null,null,null,null,null,null,null,null,null,null,null,null,null,null,null,null,null,0,0,0,0,0,null,null,null,null,null,null,null,null,null,null,null,null,null,null,null,null,null,null,null,null,"f"]
[12,{"$f":"CONCATENATE(FILIACION_ESTUDIANTE!B19,\"  \",FILIACION_ESTUDIANTE!C19,\"  \",FILIACION_ESTUDIANTE!D19)","v":"    "},null,null,null,null,null,null,null,null,null,null,null,null,null,null,null,null,null,null,null,null,null,null,null,null,null,null,0,0,0,0,0,null,null,null,null,null,{"$f":"CONCATENATE(AP20,\" \",AQ20)","v":"REGISTRO DE ASISTENCIA FEBRERO  2019"},null,null,"REGISTRO DE ASISTENCIA FEBRERO ",{"$f":"CARATULA!F26","v":2019},null,null,null,null,null,null,null,null,null,null,"p"]
[13,{"$f":"CONCATENATE(FILIACION_ESTUDIANTE!B20,\"  \",FILIACION_ESTUDIANTE!C20,\"  \",FILIACION_ESTUDIANTE!D20)","v":"    "},null,null,null,null,null,null,null,null,null,null,null,null,null,null,null,null,null,null,null,null,null,null,null,null,null,null,0,0,0,0,0,null,null,null,null,null,{"$f":"CONCATENATE(AP21,\" \",AQ21)","v":"REGISTRO DE ASISTENCIA MARZO  2019"},null,null,"REGISTRO DE ASISTENCIA MARZO ",{"$f":"AQ20","v":2019},null,null,null,null,null,null,null,null,null,null,"y"]
[14,{"$f":"CONCATENATE(FILIACION_ESTUDIANTE!B21,\"  \",FILIACION_ESTUDIANTE!C21,\"  \",FILIACION_ESTUDIANTE!D21)","v":"    "},null,null,null,null,null,null,null,null,null,null,null,null,null,null,null,null,null,null,null,null,null,null,null,null,null,null,0,0,0,0,0,null,null,null,null,null,"REGISTRO DE ASISTENCIA ABRIL  2019",null,null,"REGISTRO DE ASISTENCIA ABRIL ",{"$f":"AQ21","v":2019},null,null,null,null,null,null,null,null,null,null,"a"]
[15,{"$f":"CONCATENATE(FILIACION_ESTUDIANTE!B22,\"  \",FILIACION_ESTUDIANTE!C22,\"  \",FILIACION_ESTUDIANTE!D22)","v":"    "},null,null,null,null,null,null,null,null,null,null,null,null,null,null,null,null,null,null,null,null,null,null,null,null,null,null,0,0,0,0,0,null,null,null,null,null,"REGISTRO DE ASISTENCIA MAYO  2019",null,null,"REGISTRO DE ASISTENCIA MAYO ",{"$f":"AQ22","v":2019},null,null,null,null,null,null,null,null,null,null,"a"]
[16,{"$f":"CONCATENATE(FILIACION_ESTUDIANTE!B23,\"  \",FILIACION_ESTUDIANTE!C23,\"  \",FILIACION_ESTUDIANTE!D23)","v":"    "},null,null,null,null,null,null,null,null,null,null,null,null,null,null,null,null,null,null,null,null,null,null,null,null,null,null,0,0,0,0,0,null,null,null,null,null,"REGISTRO DE ASISTENCIA JUNIO  2019",null,null,"REGISTRO DE ASISTENCIA JUNIO ",2019,null,null,null,null,null,null,null,null,null,null,"a"]
[17,{"$f":"CONCATENATE(FILIACION_ESTUDIANTE!B24,\"  \",FILIACION_ESTUDIANTE!C24,\"  \",FILIACION_ESTUDIANTE!D24)","v":"    "},null,null,null,null,null,null,null,null,null,null,null,null,null,null,null,null,null,null,null,null,null,null,null,null,null,null,0,0,0,0,0,null,null,null,null,null,"REGISTRO DE ASISTENCIA JULIO  2019",null,null,"REGISTRO DE ASISTENCIA JULIO ",2019,null,null,null,null,null,null,null,null,null,null,"a"]
[18,{"$f":"CONCATENATE(FILIACION_ESTUDIANTE!B25,\"  \",FILIACION_ESTUDIANTE!C25,\"  \",FILIACION_ESTUDIANTE!D25)","v":"    "},null,null,null,null,null,null,null,null,null,null,null,null,null,null,null,null,null,null,null,null,null,null,null,null,null,null,0,0,0,0,0,null,null,null,null,null,"REGISTRO DE ASISTENCIA AGOSTO  2019",null,null,"REGISTRO DE ASISTENCIA AGOSTO ",2019,null,null,null,null,null,null,null,null,null,null,"a"]
[19,{"$f":"CONCATENATE(FILIACION_ESTUDIANTE!B26,\"  \",FILIACION_ESTUDIANTE!C26,\"  \",FILIACION_ESTUDIANTE!D26)","v":"    "},null,null,null,null,null,null,null,null,null,null,null,null,null,null,null,null,null,null,null,null,null,null,null,null,null,null,0,0,0,0,0,null,null,null,null,null,"REGISTRO DE ASISTENCIA SEPTIEMBRE  2019",null,null,"REGISTRO DE ASISTENCIA SEPTIEMBRE ",2019,null,null,null,null,null,null,null,null,null,null,"a"]
[20,{"$f":"CONCATENATE(FILIACION_ESTUDIANTE!B27,\"  \",FILIACION_ESTUDIANTE!C27,\"  \",FILIACION_ESTUDIANTE!D27)","v":"    "},null,null,null,null,null,null,null,null,null,null,null,null,null,null,null,null,null,null,null,null,null,null,null,null,null,null,0,0,0,0,0,null,null,null,null,null,"REGISTRO DE ASISTENCIA OCTUBRE  2019",null,null,"REGISTRO DE ASISTENCIA OCTUBRE ",2019,null,null,null,null,null,null,null,null,null,null,"f"]
[21,{"$f":"CONCATENATE(FILIACION_ESTUDIANTE!B28,\"  \",FILIACION_ESTUDIANTE!C28,\"  \",FILIACION_ESTUDIANTE!D28)","v":"    "},null,null,null,null,null,null,null,null,null,null,null,null,null,null,null,null,null,null,null,null,null,null,null,null,null,null,0,0,0,0,0,null,null,null,null,null,"REGISTRO DE ASISTENCIA NOVIEMBRE  2019",null,null,"REGISTRO DE ASISTENCIA NOVIEMBRE ",2019,null,null,null,null,null,null,null,null,null,null,"p"]
[22,{"$f":"CONCATENATE(FILIACION_ESTUDIANTE!B29,\"  \",FILIACION_ESTUDIANTE!C29,\"  \",FILIACION_ESTUDIANTE!D29)","v":"    "},null,null,null,null,null,null,null,null,null,null,null,null,null,null,null,null,null,null,null,null,null,null,null,null,null,null,0,0,0,0,0,null,null,null,null,null,"REGISTRO DE ASISTENCIA DICIEMBRE  2019",null,null,"REGISTRO DE ASISTENCIA DICIEMBRE ",2019,null,null,null,null,null,null,null,null,null,null,"M"]
[23,{"$f":"CONCATENATE(FILIACION_ESTUDIANTE!B30,\"  \",FILIACION_ESTUDIANTE!C30,\"  \",FILIACION_ESTUDIANTE!D30)","v":"    "},null,null,null,null,null,null,null,null,null,null,null,null,null,null,null,null,null,null,null,null,null,null,null,null,null,null,0,0,0,0,0]
[24,{"$f":"CONCATENATE(FILIACION_ESTUDIANTE!B31,\"  \",FILIACION_ESTUDIANTE!C31,\"  \",FILIACION_ESTUDIANTE!D31)","v":"    "},null,null,null,null,null,null,null,null,null,null,null,null,null,null,null,null,null,null,null,null,null,null,null,null,null,null,0,0,0,0,0,null,null,null,null,null,null,null,null,null,null,null,null,null,null,null,null,null,null,null,null,"M"]
[25,{"$f":"CONCATENATE(FILIACION_ESTUDIANTE!B32,\"  \",FILIACION_ESTUDIANTE!C32,\"  \",FILIACION_ESTUDIANTE!D32)","v":"    "},null,null,null,null,null,null,null,null,null,null,null,null,null,null,null,null,null,null,null,null,null,null,null,null,null,null,0,0,0,0,0,null,null,null,null,null,null,null,null,null,null,null,null,null,null,null,null,null,null,null,null,"M"]
[26,{"$f":"CONCATENATE(FILIACION_ESTUDIANTE!B33,\"  \",FILIACION_ESTUDIANTE!C33,\"  \",FILIACION_ESTUDIANTE!D33)","v":"    "},null,null,null,null,null,null,null,null,null,null,null,null,null,null,null,null,null,null,null,null,null,null,null,null,null,null,0,0,0,0,0,null,null,null,null,null,null,null,null,null,null,null,null,null,null,null,null,null,null,null,null,"M"]
[27,{"$f":"CONCATENATE(FILIACION_ESTUDIANTE!B34,\"  \",FILIACION_ESTUDIANTE!C34,\"  \",FILIACION_ESTUDIANTE!D34)","v":"    "},null,null,null,null,null,null,null,null,null,null,null,null,null,null,null,null,null,null,null,null,null,null,null,null,null,null,0,0,0,0,0,null,null,null,null,null,null,null,null,null,null,null,null,null,null,null,null,null,null,null,null,"M"]
[28,{"$f":"CONCATENATE(FILIACION_ESTUDIANTE!B35,\"  \",FILIACION_ESTUDIANTE!C35,\"  \",FILIACION_ESTUDIANTE!D35)","v":"    "},null,null,null,null,null,null,null,null,null,null,null,null,null,null,null,null,null,null,null,null,null,null,null,null,null,null,0,0,0,0,0,null,null,null,null,null,null,null,null,null,null,null,null,null,null,null,null,null,null,null,null,"M"]
[29,{"$f":"CONCATENATE(FILIACION_ESTUDIANTE!B36,\"  \",FILIACION_ESTUDIANTE!C36,\"  \",FILIACION_ESTUDIANTE!D36)","v":"    "},null,null,null,null,null,null,null,null,null,null,null,null,null,null,null,null,null,null,null,null,null,null,null,null,null,null,0,0,0,0,0]
[30,{"$f":"CONCATENATE(FILIACION_ESTUDIANTE!B37,\"  \",FILIACION_ESTUDIANTE!C37,\"  \",FILIACION_ESTUDIANTE!D37)","v":"    "},null,null,null,null,null,null,null,null,null,null,null,null,null,null,null,null,null,null,null,null,null,null,null,null,null,null,0,0,0,0,0]
[31,{"$f":"CONCATENATE(FILIACION_ESTUDIANTE!B38,\"  \",FILIACION_ESTUDIANTE!C38,\"  \",FILIACION_ESTUDIANTE!D38)","v":"    "},null,null,null,null,null,null,null,null,null,null,null,null,null,null,null,null,null,null,null,null,null,null,null,null,null,null,0,0,0,0,0,null,null,null,null,null,null,null,null,null,null,null,null,null,null,null,null,null,null,null,null,"M"]
[32,{"$f":"CONCATENATE(FILIACION_ESTUDIANTE!B39,\"  \",FILIACION_ESTUDIANTE!C39,\"  \",FILIACION_ESTUDIANTE!D39)","v":"    "},null,null,null,null,null,null,null,null,null,null,null,null,null,null,null,null,null,null,null,null,null,null,null,null,null,null,0,0,0,0,0,null,null,null,null,null,null,null,null,null,null,null,null,null,null,null,null,null,null,null,null,"M"]
[33,{"$f":"CONCATENATE(FILIACION_ESTUDIANTE!B40,\"  \",FILIACION_ESTUDIANTE!C40,\"  \",FILIACION_ESTUDIANTE!D40)","v":"    "},null,null,null,null,null,null,null,null,null,null,null,null,null,null,null,null,null,null,null,null,null,null,null,null,null,null,0,0,0,0,0]
[34,{"$f":"CONCATENATE(FILIACION_ESTUDIANTE!B41,\"  \",FILIACION_ESTUDIANTE!C41,\"  \",FILIACION_ESTUDIANTE!D41)","v":"    "},null,null,null,null,null,null,null,null,null,null,null,null,null,null,null,null,null,null,null,null,null,null,null,null,null,null,0,0,0,0,0]
[35,{"$f":"CONCATENATE(FILIACION_ESTUDIANTE!B42,\"  \",FILIACION_ESTUDIANTE!C42,\"  \",FILIACION_ESTUDIANTE!D42)","v":"    "},null,null,null,null,null,null,null,null,null,null,null,null,null,null,null,null,null,null,null,null,null,null,null,null,null,null,0,0,0,0,0]
[36,{"$f":"CONCATENATE(FILIACION_ESTUDIANTE!B43,\"  \",FILIACION_ESTUDIANTE!C43,\"  \",FILIACION_ESTUDIANTE!D43)","v":"    "},null,null,null,null,null,null,null,null,null,null,null,null,null,null,null,null,null,null,null,null,null,null,null,null,null,null,0,0,0,0,0]
[37,{"$f":"CONCATENATE(FILIACION_ESTUDIANTE!B44,\"  \",FILIACION_ESTUDIANTE!C44,\"  \",FILIACION_ESTUDIANTE!D44)","v":"    "},null,null,null,null,null,null,null,null,null,null,null,null,null,null,null,null,null,null,null,null,null,null,null,null,null,null,0,0,0,0,0]
[38,{"$f":"CONCATENATE(FILIACION_ESTUDIANTE!B45,\"  \",FILIACION_ESTUDIANTE!C45,\"  \",FILIACION_ESTUDIANTE!D45)","v":"    "},null,null,null,null,null,null,null,null,null,null,null,null,null,null,null,null,null,null,null,null,null,null,null,null,null,null,0,0,0,0,0]
[39,{"$f":"CONCATENATE(FILIACION_ESTUDIANTE!B46,\"  \",FILIACION_ESTUDIANTE!C46,\"  \",FILIACION_ESTUDIANTE!D46)","v":"    "},null,null,null,null,null,null,null,null,null,null,null,null,null,null,null,null,null,null,null,null,null,null,null,null,null,null,0,0,0,0,0]
[40,{"$f":"CONCATENATE(FILIACION_ESTUDIANTE!B47,\"  \",FILIACION_ESTUDIANTE!C47,\"  \",FILIACION_ESTUDIANTE!D47)","v":"    "},null,null,null,null,null,null,null,null,null,null,null,null,null,null,null,null,null,null,null,null,null,null,null,null,null,null,0,0,0,0,0]
[null,null,null,null,null,null,null,null,null,null,null,null,null,null,null,null,null,null,null,null,null,null,null,null,"TOTAL",null,null,null,{"$f":"SUM(AC9:AC48)","v":0},{"$f":"SUM(AD9:AD48)","v":0},{"$f":"SUM(AE9:AF48)","v":0},null,{"$f":"SUM(AG9:AG48)","v":0}]
[]
[null,null,null,null,null,null,null,null,null,null,null,null,null,null,null,null,null,null,null,null,null,null,null,null,null,null,null,"%",null,null,null,null,null,null,null,null,{"$f":"(SUM(AG9:AG48,AC9:AD48)/D54)","v":{"$error":"#DIV/0!"}},"SUMATORIA","DIAS TRAB","PROMEDIO"]
[null,null,null,null,null,null,null,null,null,null,null,null,null,null,null,"LICENCIA",null,null,null,null,null,null,"LICENCIA",null,null,null,null,{"$f":"IFERROR(AC49/AG49,\"\")","v":""},null,null,null,null,null,null,null,null,"PRESENTE",{"$f":"IF(AK51=0,\"\",SUM(AE9:AG48))","v":{"$error":"#DIV/0!"}},{"$f":"IF(AK51=0,\"\",AK51)","v":{"$error":"#DIV/0!"}},{"$f":"IF(AK51=0,\"\",AL52/AM52)","v":{"$error":"#DIV/0!"}}]
[null,null,null,null,null,null,null,null,null,null,null,null,null,null,null,"FALTA",null,null,null,null,null,null,"FALTA",null,null,null,null,{"$f":"IFERROR(AD49/AG49,\"\")","v":""},null,null,null,null,null,null,null,null,"FALTA",{"$f":"IF(AK51=0,\"\",SUM(AC9:AD48))","v":{"$error":"#DIV/0!"}},{"$f":"IF(AK51=0,\"\",AK51)","v":{"$error":"#DIV/0!"}},{"$f":"IF(AK51=0,\"\",AL53/AM53)","v":{"$error":"#DIV/0!"}}]
[null,null,null,null,null,null,null,null,null,null,null,null,null,null,null,"PRESENTE",null,null,null,null,null,null,"PRESENTE",null,null,null,null,{"$f":"IFERROR(AE49/AG49,\"\")","v":""},null,null,null,null,null,null,null,null,null,null,null,{"$f":"SUM(AN52:AN53)","v":{"$error":"#DIV/0!"}}]
[null,null,null,null,null,null,null,null,null,null,null,null,null,null,null,"TOTAL",null,null,null,null,null,null,"TOTAL %",null,null,null,null,{"$f":"SUM(AB52:AD54)","v":0}]

{"sheet":"MARZO","index":10,"n_rows":55,"n_cols":54,"rows_kept":55,"cut":false,"hidden":false,"merged":[[6,32,7,32],[6,31,7,31],[6,28,7,28],[6,29,7,29],[48,34,56,34],[48,30,48,31],[52,27,52,29],[6,30,7,30],[55,27,55,29],[0,0,0,32],[0,34,0,35],[1,0,1,32],[2,0,2,32],[5,0,5,32],[3,28,3,32],[4,0,4,2],[4,3,4,32],[3,0,3,2],[3,3,3,12],[3,24,3,27],[13,1,13,4],[49,27,49,29],[14,1,14,4],[26,38,26,40],[27,38,27,40],[28,38,28,40],[29,38,29,40],[26,1,26,4],[27,1,27,4],[28,1,28,4],[8,34,47,34],[19,38,19,40],[20,38,20,40],[21,38,21,40],[22,38,22,40],[23,38,23,40],[36,1,36,4],[37,1,37,4],[38,1,38,4],[39,1,39,4],[42,1,42,4],[6,0,7,0],[6,1,7,3],[50,15,50,21],[50,22,50,26],[50,27,50,29],[49,22,49,26],[50,8,50,11],[8,1,8,4],[9,1,9,4],[35,1,35,4],[48,24,48,27],[11,1,11,4],[10,1,10,4],[12,1,12,4],[49,4,49,7],[29,1,29,4],[16,38,18,40],[24,1,24,4],[25,1,25,4],[23,1,23,4],[24,38,24,40],[25,38,25,40],[22,1,22,4],[20,1,20,4],[21,1,21,4],[17,1,17,4],[18,1,18,4],[19,1,19,4],[53,22,53,26],[53,27,53,29],[54,22,54,26],[54,27,54,29],[40,1,40,4],[41,1,41,4],[44,1,44,4],[49,8,49,11],[51,15,51,21],[51,22,51,26],[51,27,51,29],[52,15,52,21],[52,22,52,26],[45,1,45,4],[46,1,46,4],[55,22,55,26],[15,1,15,4],[16,1,16,4],[51,8,51,11],[52,8,52,11],[30,1,30,4],[31,1,31,4],[32,1,32,4],[33,1,33,4],[34,1,34,4],[50,4,50,7],[51,4,51,7],[52,1,52,2],[52,4,52,7],[43,1,43,4],[47,1,47,4]]}
[null,null,null,null,null,null,null,null,null,null,null,null,null,null,null,null,null,null,null,null,null,null,null,null,null,null,null,null,null,null,null,null,null,null,"ASISTENCIAS E INASISTENCIAS",null,"AZUL"]
[null,null,null,null,null,null,null,null,null,null,null,null,null,null,null,null,null,null,null,null,null,null,null,null,null,null,null,null,null,null,null,null,null,null,"Presente","P"]
[{"$f":"AM20","v":"REGISTRO DE ASISTENCIA MARZO  2019"},null,null,null,null,null,null,null,null,null,null,null,null,null,null,null,null,null,null,null,null,null,null,null,null,null,null,null,null,null,null,null,null,null,"Atraso","A"]
[{"$f":"+UPPER(CARATULA!C20)","v":"MAESTRA (O):"},null,null,{"$f":"CARATULA!E20","v":0},null,null,null,null,null,null,null,null,null,null,null,null,null,null,null,null,null,null,null,null,"TURNO: ",null,null,null,{"$f":"CARATULA!E13","v":0},null,null,null,null,null,"falta con licencia","F"]
["PARALELO:",null,null,{"$f":"CARATULA!E14","v":0},null,null,null,null,null,null,null,null,null,null,null,null,null,null,null,null,null,null,null,null,null,null,null,null,null,null,null,null,null,null,"Falta sin licencia","L"]
[{"$f":"+CONCATENATE(\"AÑO DE ESCOLARIDAD:  \",CARATULA!E21)","v":"AÑO DE ESCOLARIDAD:  "}]
["Nº","NÓMINA",null,null,"DÍA","V","L","M","M","J","V","L","M","M","J","V","L","M","M","J","V","L","M","M","J","V",null,null,"LICENCIA (L)","FALTA (F)","ATRASO (A)","PRESENTE (P)","DÍAS TRABAJADOS",null,"dias materias tecnicas",0]
[null,null,null,null,"FECHA",1,{"$f":"F8+3","v":4},{"$f":"G8+1","v":5},{"$f":"H8+1","v":6},{"$f":"I8+1","v":7},{"$f":"J8+1","v":8},{"$f":"K8+3","v":11},{"$f":"L8+1","v":12},{"$f":"M8+1","v":13},{"$f":"N8+1","v":14},{"$f":"O8+1","v":15},{"$f":"P8+3","v":18},{"$f":"Q8+1","v":19},{"$f":"R8+1","v":20},{"$f":"S8+1","v":21},{"$f":"T8+1","v":22},{"$f":"U8+3","v":25},{"$f":"V8+1","v":26},{"$f":"W8+1","v":27},{"$f":"X8+1","v":28},{"$f":"Y8+1","v":29},null,{"$f":"IF($AI$9=\"FEBRERO\",\"\",AA8+1)","v":""}]
[1,{"$f":"CONCATENATE(FILIACION_ESTUDIANTE!B8,\"  \",FILIACION_ESTUDIANTE!C8,\"  \",FILIACION_ESTUDIANTE!D8)","v":"    "},null,null,null,null,null,null,null,null,null,null,null,null,null,null,null,null,null,null,null,null,null,null,null,null,null,null,{"$f":"COUNTIF((F9:AB9),\"L\")","v":0},{"$f":"COUNTIF((F9:AB9),\"F\")","v":0},{"$f":"COUNTIF((F9:AB9),\"A\")","v":0},{"$f":"COUNTIF((F9:AB9),\"P\")","v":0},{"$f":"ROUND(SUM(AC9:AF9),)","v":0},null,"FEBRERO"]
[2,{"$f":"CONCATENATE(FILIACION_ESTUDIANTE!B9,\"  \",FILIACION_ESTUDIANTE!C9,\"  \",FILIACION_ESTUDIANTE!D9)","v":"    "},null,null,null,null,null,null,null,null,null,null,null,null,null,null,null,null,null,null,null,null,null,null,null,null,null,null,{"$f":"COUNTIF((F10:AB10),\"L\")","v":0},{"$f":"COUNTIF((F10:AB10),\"F\")","v":0},{"$f":"COUNTIF((F10:AB10),\"A\")","v":0},{"$f":"COUNTIF((F10:AB10),\"P\")","v":0},0]
[3,{"$f":"CONCATENATE(FILIACION_ESTUDIANTE!B10,\"  \",FILIACION_ESTUDIANTE!C10,\"  \",FILIACION_ESTUDIANTE!D10)","v":"    "},null,null,null,null,null,null,null,null,null,null,null,null,null,null,null,null,null,null,null,null,null,null,null,null,null,null,0,0,0,0,0]
[4,{"$f":"CONCATENATE(FILIACION_ESTUDIANTE!B11,\"  \",FILIACION_ESTUDIANTE!C11,\"  \",FILIACION_ESTUDIANTE!D11)","v":"    "},null,null,null,null,null,null,null,null,null,null,null,null,null,null,null,null,null,null,null,null,null,null,null,null,null,null,0,0,0,0,0,null,null,null,null,null,null,null,null,null,null,null,null,null,null,null,null,null,null,null,{"$f":"ISLOGICAL((#REF!))","v":false},1]
[5,{"$f":"CONCATENATE(FILIACION_ESTUDIANTE!B12,\"  \",FILIACION_ESTUDIANTE!C12,\"  \",FILIACION_ESTUDIANTE!D12)","v":"    "},null,null,null,null,null,null,null,null,null,null,null,null,null,null,null,null,null,null,null,null,null,null,null,null,null,null,0,0,0,0,0,null,null,null,null,null,null,null,null,null,null,null,null,null,null,null,null,null,null,null,null,"A"]
[6,{"$f":"CONCATENATE(FILIACION_ESTUDIANTE!B13,\"  \",FILIACION_ESTUDIANTE!C13,\"  \",FILIACION_ESTUDIANTE!D13)","v":"    "},null,null,null,null,null,null,null,null,null,null,null,null,null,null,null,null,null,null,null,null,null,null,null,null,null,null,0,0,0,0,0,null,null,null,null,null,null,null,null,null,null,null,null,null,null,null,null,null,null,{"$f":"ISTEXT(#REF!)","v":false}]
[7,{"$f":"CONCATENATE(FILIACION_ESTUDIANTE!B14,\"  \",FILIACION_ESTUDIANTE!C14,\"  \",FILIACION_ESTUDIANTE!D14)","v":"    "},null,null,null,null,null,null,null,null,null,null,null,null,null,null,null,null,null,null,null,null,null,null,null,null,null,null,0,0,0,0,0,null,null,null,null,null,null,null,null,null,null,null,null,null,null,null,null,null,null,null,null,"a"]
[8,{"$f":"CONCATENATE(FILIACION_ESTUDIANTE!B15,\"  \",FILIACION_ESTUDIANTE!C15,\"  \",FILIACION_ESTUDIANTE!D15)","v":"    "},null,null,null,null,null,null,null,null,null,null,null,null,null,null,null,null,null,null,null,null,null,null,null,null,null,null,0,0,0,0,0,null,null,null,null,null,null,null,null,null,null,null,null,null,null,null,null,null,null,null,null,"a"]
[9,{"$f":"CONCATENATE(FILIACION_ESTUDIANTE!B16,\"  \",FILIACION_ESTUDIANTE!C16,\"  \",FILIACION_ESTUDIANTE!D16)","v":"    "},null,null,null,null,null,null,null,null,null,null,null,null,null,null,null,null,null,null,null,null,null,null,null,null,null,null,0,0,0,0,0,null,null,null,null,null,"ENCABEZADO DE LOS FORMULARIOS DE CONTROL DE ASISTENCIA",null,null,null,null,null,null,null,null,null,null,null,{"$f":"MONTH(AY18)","v":2},null,null,"f"]
[10,{"$f":"CONCATENATE(FILIACION_ESTUDIANTE!B17,\"  \",FILIACION_ESTUDIANTE!C17,\"  \",FILIACION_ESTUDIANTE!D17)","v":"    "},null,null,null,null,null,null,null,null,null,null,null,null,null,null,null,null,null,null,null,null,null,null,null,null,null,null,0,0,0,0,0,null,null,null,null,null,null,null,null,null,null,null,null,null,null,null,null,null,"2010-02-01",null,null,"f"]
[11,{"$f":"CONCATENATE(FILIACION_ESTUDIANTE!B18,\"  \",FILIACION_ESTUDIANTE!C18,\"  \",FILIACION_ESTUDIANTE!D18)","v":"    "},null,null,null,null,null,null,null,null,null,null,null,null,null,null,null,null,null,null,null,null,null,null,null,null,null,null,0,0,0,0,0,null,null,null,null,null,null,null,null,null,null,null,null,null,null,null,null,null,null,null,null,"f"]
[12,{"$f":"CONCATENATE(FILIACION_ESTUDIANTE!B19,\"  \",FILIACION_ESTUDIANTE!C19,\"  \",FILIACION_ESTUDIANTE!D19)","v":"    "},null,null,null,null,null,null,null,null,null,null,null,null,null,null,null,null,null,null,null,null,null,null,null,null,null,null,0,0,0,0,0,null,null,null,null,null,{"$f":"CONCATENATE(AP20,\" \",AQ20)","v":"REGISTRO DE ASISTENCIA MARZO  2019"},null,null,"REGISTRO DE ASISTENCIA MARZO ",{"$f":"CARATULA!F26","v":2019},null,null,null,null,null,null,null,null,null,null,"p"]
[13,{"$f":"CONCATENATE(FILIACION_ESTUDIANTE!B20,\"  \",FILIACION_ESTUDIANTE!C20,\"  \",FILIACION_ESTUDIANTE!D20)","v":"    "},null,null,null,null,null,null,null,null,null,null,null,null,null,null,null,null,null,null,null,null,null,null,null,null,null,null,0,0,0,0,0,null,null,null,null,null,{"$f":"CONCATENATE(AP21,\" \",AQ21)","v":"REGISTRO DE ASISTENCIA MARZO  2019"},null,null,"REGISTRO DE ASISTENCIA MARZO ",{"$f":"AQ20","v":2019},null,null,null,null,null,null,null,null,null,null,"y"]
[14,{"$f":"CONCATENATE(FILIACION_ESTUDIANTE!B21,\"  \",FILIACION_ESTUDIANTE!C21,\"  \",FILIACION_ESTUDIANTE!D21)","v":"    "},null,null,null,null,null,null,null,null,null,null,null,null,null,null,null,null,null,null,null,null,null,null,null,null,null,null,0,0,0,0,0,null,null,null,null,null,"REGISTRO DE ASISTENCIA ABRIL  2019",null,null,"REGISTRO DE ASISTENCIA ABRIL ",{"$f":"AQ21","v":2019},null,null,null,null,null,null,null,null,null,null,"a"]
[15,{"$f":"CONCATENATE(FILIACION_ESTUDIANTE!B22,\"  \",FILIACION_ESTUDIANTE!C22,\"  \",FILIACION_ESTUDIANTE!D22)","v":"    "},null,null,null,null,null,null,null,null,null,null,null,null,null,null,null,null,null,null,null,null,null,null,null,null,null,null,0,0,0,0,0,null,null,null,null,null,"REGISTRO DE ASISTENCIA MAYO  2019",null,null,"REGISTRO DE ASISTENCIA MAYO ",{"$f":"AQ22","v":2019},null,null,null,null,null,null,null,null,null,null,"a"]
[16,{"$f":"CONCATENATE(FILIACION_ESTUDIANTE!B23,\"  \",FILIACION_ESTUDIANTE!C23,\"  \",FILIACION_ESTUDIANTE!D23)","v":"    "},null,null,null,null,null,null,null,null,null,null,null,null,null,null,null,null,null,null,null,null,null,null,null,null,null,null,0,0,0,0,0,null,null,null,null,null,"REGISTRO DE ASISTENCIA JUNIO  2019",null,null,"REGISTRO DE ASISTENCIA JUNIO ",2019,null,null,null,null,null,null,null,null,null,null,"a"]
[17,{"$f":"CONCATENATE(FILIACION_ESTUDIANTE!B24,\"  \",FILIACION_ESTUDIANTE!C24,\"  \",FILIACION_ESTUDIANTE!D24)","v":"    "},null,null,null,null,null,null,null,null,null,null,null,null,null,null,null,null,null,null,null,null,null,null,null,null,null,null,0,0,0,0,0,null,null,null,null,null,"REGISTRO DE ASISTENCIA JULIO  2019",null,null,"REGISTRO DE ASISTENCIA JULIO ",2019,null,null,null,null,null,null,null,null,null,null,"a"]
[18,{"$f":"CONCATENATE(FILIACION_ESTUDIANTE!B25,\"  \",FILIACION_ESTUDIANTE!C25,\"  \",FILIACION_ESTUDIANTE!D25)","v":"    "},null,null,null,null,null,null,null,null,null,null,null,null,null,null,null,null,null,null,null,null,null,null,null,null,null,null,0,0,0,0,0,null,null,null,null,null,"REGISTRO DE ASISTENCIA AGOSTO  2019",null,null,"REGISTRO DE ASISTENCIA AGOSTO ",2019,null,null,null,null,null,null,null,null,null,null,"a"]
[19,{"$f":"CONCATENATE(FILIACION_ESTUDIANTE!B26,\"  \",FILIACION_ESTUDIANTE!C26,\"  \",FILIACION_ESTUDIANTE!D26)","v":"    "},null,null,null,null,null,null,null,null,null,null,null,null,null,null,null,null,null,null,null,null,null,null,null,null,null,null,0,0,0,0,0,null,null,null,null,null,"REGISTRO DE ASISTENCIA SEPTIEMBRE  2019",null,null,"REGISTRO DE ASISTENCIA SEPTIEMBRE ",2019,null,null,null,null,null,null,null,null,null,null,"a"]
[20,{"$f":"CONCATENATE(FILIACION_ESTUDIANTE!B27,\"  \",FILIACION_ESTUDIANTE!C27,\"  \",FILIACION_ESTUDIANTE!D27)","v":"    "},null,null,null,null,null,null,null,null,null,null,null,null,null,null,null,null,null,null,null,null,null,null,null,null,null,null,0,0,0,0,0,null,null,null,null,null,"REGISTRO DE ASISTENCIA OCTUBRE  2019",null,null,"REGISTRO DE ASISTENCIA OCTUBRE ",2019,null,null,null,null,null,null,null,null,null,null,"f"]
[21,{"$f":"CONCATENATE(FILIACION_ESTUDIANTE!B28,\"  \",FILIACION_ESTUDIANTE!C28,\"  \",FILIACION_ESTUDIANTE!D28)","v":"    "},null,null,null,null,null,null,null,null,null,null,null,null,null,null,null,null,null,null,null,null,null,null,null,null,null,null,0,0,0,0,0,null,null,null,null,null,"REGISTRO DE ASISTENCIA NOVIEMBRE  2019",null,null,"REGISTRO DE ASISTENCIA NOVIEMBRE ",2019,null,null,null,null,null,null,null,null,null,null,"p"]
[22,{"$f":"CONCATENATE(FILIACION_ESTUDIANTE!B29,\"  \",FILIACION_ESTUDIANTE!C29,\"  \",FILIACION_ESTUDIANTE!D29)","v":"    "},null,null,null,null,null,null,null,null,null,null,null,null,null,null,null,null,null,null,null,null,null,null,null,null,null,null,0,0,0,0,0,null,null,null,null,null,"REGISTRO DE ASISTENCIA DICIEMBRE  2019",null,null,"REGISTRO DE ASISTENCIA DICIEMBRE ",2019,null,null,null,null,null,null,null,null,null,null,"M"]
[23,{"$f":"CONCATENATE(FILIACION_ESTUDIANTE!B30,\"  \",FILIACION_ESTUDIANTE!C30,\"  \",FILIACION_ESTUDIANTE!D30)","v":"    "},null,null,null,null,null,null,null,null,null,null,null,null,null,null,null,null,null,null,null,null,null,null,null,null,null,null,0,0,0,0,0]
[24,{"$f":"CONCATENATE(FILIACION_ESTUDIANTE!B31,\"  \",FILIACION_ESTUDIANTE!C31,\"  \",FILIACION_ESTUDIANTE!D31)","v":"    "},null,null,null,null,null,null,null,null,null,null,null,null,null,null,null,null,null,null,null,null,null,null,null,null,null,null,0,0,0,0,0,null,null,null,null,null,null,null,null,null,null,null,null,null,null,null,null,null,null,null,null,"M"]
[25,{"$f":"CONCATENATE(FILIACION_ESTUDIANTE!B32,\"  \",FILIACION_ESTUDIANTE!C32,\"  \",FILIACION_ESTUDIANTE!D32)","v":"    "},null,null,null,null,null,null,null,null,null,null,null,null,null,null,null,null,null,null,null,null,null,null,null,null,null,null,0,0,0,0,0,null,null,null,null,null,null,null,null,null,null,null,null,null,null,null,null,null,null,null,null,"M"]
[26,{"$f":"CONCATENATE(FILIACION_ESTUDIANTE!B33,\"  \",FILIACION_ESTUDIANTE!C33,\"  \",FILIACION_ESTUDIANTE!D33)","v":"    "},null,null,null,null,null,null,null,null,null,null,null,null,null,null,null,null,null,null,null,null,null,null,null,null,null,null,0,0,0,0,0,null,null,null,null,null,null,null,null,null,null,null,null,null,null,null,null,null,null,null,null,"M"]
[27,{"$f":"CONCATENATE(FILIACION_ESTUDIANTE!B34,\"  \",FILIACION_ESTUDIANTE!C34,\"  \",FILIACION_ESTUDIANTE!D34)","v":"    "},null,null,null,null,null,null,null,null,null,null,null,null,null,null,null,null,null,null,null,null,null,null,null,null,null,null,0,0,0,0,0,null,null,null,null,null,null,null,null,null,null,null,null,null,null,null,null,null,null,null,null,"M"]
[28,{"$f":"CONCATENATE(FILIACION_ESTUDIANTE!B35,\"  \",FILIACION_ESTUDIANTE!C35,\"  \",FILIACION_ESTUDIANTE!D35)","v":"    "},null,null,null,null,null,null,null,null,null,null,null,null,null,null,null,null,null,null,null,null,null,null,null,null,null,null,0,0,0,0,0,null,null,null,null,null,null,null,null,null,null,null,null,null,null,null,null,null,null,null,null,"M"]
[29,{"$f":"CONCATENATE(FILIACION_ESTUDIANTE!B36,\"  \",FILIACION_ESTUDIANTE!C36,\"  \",FILIACION_ESTUDIANTE!D36)","v":"    "},null,null,null,null,null,null,null,null,null,null,null,null,null,null,null,null,null,null,null,null,null,null,null,null,null,null,0,0,0,0,0]
[30,{"$f":"CONCATENATE(FILIACION_ESTUDIANTE!B37,\"  \",FILIACION_ESTUDIANTE!C37,\"  \",FILIACION_ESTUDIANTE!D37)","v":"    "},null,null,null,null,null,null,null,null,null,null,null,null,null,null,null,null,null,null,null,null,null,null,null,null,null,null,0,0,0,0,0]
[31,{"$f":"CONCATENATE(FILIACION_ESTUDIANTE!B38,\"  \",FILIACION_ESTUDIANTE!C38,\"  \",FILIACION_ESTUDIANTE!D38)","v":"    "},null,null,null,null,null,null,null,null,null,null,null,null,null,null,null,null,null,null,null,null,null,null,null,null,null,null,0,0,0,0,0,null,null,null,null,null,null,null,null,null,null,null,null,null,null,null,null,null,null,null,null,"M"]
[32,{"$f":"CONCATENATE(FILIACION_ESTUDIANTE!B39,\"  \",FILIACION_ESTUDIANTE!C39,\"  \",FILIACION_ESTUDIANTE!D39)","v":"    "},null,null,null,null,null,null,null,null,null,null,null,null,null,null,null,null,null,null,null,null,null,null,null,null,null,null,0,0,0,0,0,null,null,null,null,null,null,null,null,null,null,null,null,null,null,null,null,null,null,null,null,"M"]
[33,{"$f":"CONCATENATE(FILIACION_ESTUDIANTE!B40,\"  \",FILIACION_ESTUDIANTE!C40,\"  \",FILIACION_ESTUDIANTE!D40)","v":"    "},null,null,null,null,null,null,null,null,null,null,null,null,null,null,null,null,null,null,null,null,null,null,null,null,null,null,0,0,0,0,0]
[34,{"$f":"CONCATENATE(FILIACION_ESTUDIANTE!B41,\"  \",FILIACION_ESTUDIANTE!C41,\"  \",FILIACION_ESTUDIANTE!D41)","v":"    "},null,null,null,null,null,null,null,null,null,null,null,null,null,null,null,null,null,null,null,null,null,null,null,null,null,null,0,0,0,0,0]
[35,{"$f":"CONCATENATE(FILIACION_ESTUDIANTE!B42,\"  \",FILIACION_ESTUDIANTE!C42,\"  \",FILIACION_ESTUDIANTE!D42)","v":"    "},null,null,null,null,null,null,null,null,null,null,null,null,null,null,null,null,null,null,null,null,null,null,null,null,null,null,0,0,0,0,0]
[36,{"$f":"CONCATENATE(FILIACION_ESTUDIANTE!B43,\"  \",FILIACION_ESTUDIANTE!C43,\"  \",FILIACION_ESTUDIANTE!D43)","v":"    "},null,null,null,null,null,null,null,null,null,null,null,null,null,null,null,null,null,null,null,null,null,null,null,null,null,null,0,0,0,0,0]
[37,{"$f":"CONCATENATE(FILIACION_ESTUDIANTE!B44,\"  \",FILIACION_ESTUDIANTE!C44,\"  \",FILIACION_ESTUDIANTE!D44)","v":"    "},null,null,null,null,null,null,null,null,null,null,null,null,null,null,null,null,null,null,null,null,null,null,null,null,null,null,0,0,0,0,0]
[38,{"$f":"CONCATENATE(FILIACION_ESTUDIANTE!B45,\"  \",FILIACION_ESTUDIANTE!C45,\"  \",FILIACION_ESTUDIANTE!D45)","v":"    "},null,null,null,null,null,null,null,null,null,null,null,null,null,null,null,null,null,null,null,null,null,null,null,null,null,null,0,0,0,0,0]
[39,{"$f":"CONCATENATE(FILIACION_ESTUDIANTE!B46,\"  \",FILIACION_ESTUDIANTE!C46,\"  \",FILIACION_ESTUDIANTE!D46)","v":"    "},null,null,null,null,null,null,null,null,null,null,null,null,null,null,null,null,null,null,null,null,null,null,null,null,null,null,0,0,0,0,0]
[40,{"$f":"CONCATENATE(FILIACION_ESTUDIANTE!B47,\"  \",FILIACION_ESTUDIANTE!C47,\"  \",FILIACION_ESTUDIANTE!D47)","v":"    "},null,null,null,null,null,null,null,null,null,null,null,null,null,null,null,null,null,null,null,null,null,null,null,null,null,null,0,0,0,0,0]
[null,null,null,null,null,null,null,null,null,null,null,null,null,null,null,null,null,null,null,null,null,null,null,null,"TOTAL",null,null,null,{"$f":"SUM(AC9:AC48)","v":0},{"$f":"SUM(AD9:AD48)","v":0},{"$f":"SUM(AE9:AF48)","v":0},null,{"$f":"SUM(AG9:AG48)","v":0}]
[null,null,null,null,null,null,null,null,null,null,null,null,null,null,null,null,null,null,null,null,null,null,null,null,null,null,null,null,null,null,null,null,null,null,null,null,{"$f":"(SUM(AG9:AG48,AC9:AD48)/D53)","v":{"$error":"#DIV/0!"}},"SUMATORIA","DIAS TRAB","PROMEDIO"]
[null,null,null,null,null,null,null,null,null,null,null,null,null,null,null,null,null,null,null,null,null,null,null,null,null,null,null,"%",null,null,null,null,null,null,null,null,"PRESENTE",{"$f":"IF(AK50=0,\"\",SUM(AE9:AG48))","v":{"$error":"#DIV/0!"}},{"$f":"IF(AK50=0,\"\",AK50)","v":{"$error":"#DIV/0!"}},{"$f":"IF(AK50=0,\"\",AL51/AM51)","v":{"$error":"#DIV/0!"}}]
[null,null,null,null,null,null,null,null,null,null,null,null,null,null,null,null,null,null,null,null,null,null,"LICENCIA",null,null,null,null,{"$f":"IFERROR(AC49/AG49,\"\")","v":""},null,null,null,null,null,null,null,null,"FALTA",{"$f":"IF(AK50=0,\"\",SUM(AC9:AD48))","v":{"$error":"#DIV/0!"}},{"$f":"IF(AK50=0,\"\",AK50)","v":{"$error":"#DIV/0!"}},{"$f":"IF(AK50=0,\"\",AL52/AM52)","v":{"$error":"#DIV/0!"}}]
[null,null,null,null,null,null,null,null,null,null,null,null,null,null,null,null,null,null,null,null,null,null,"FALTA",null,null,null,null,{"$f":"IFERROR(AD49/AG49,\"\")","v":""},null,null,null,null,null,null,null,null,null,null,null,{"$f":"SUM(AN51:AN52)","v":{"$error":"#DIV/0!"}}]
[null,null,null,null,null,null,null,null,null,null,null,null,null,null,null,null,null,null,null,null,null,null,"PRESENTE",null,null,null,null,{"$f":"IFERROR(AE49/AG49,\"\")","v":""}]
[null,null,null,null,null,null,null,null,null,null,null,null,null,null,null,null,null,null,null,null,null,null,"TOTAL %",null,null,null,null,{"$f":"IFERROR(SUM(AB52:AD54),)","v":0}]

{"sheet":"ABRIL","index":11,"n_rows":55,"n_cols":59,"rows_kept":55,"cut":false,"hidden":false,"merged":[[41,1,41,4],[42,1,42,4],[43,1,43,4],[44,1,44,4],[36,1,36,4],[37,1,37,4],[38,1,38,4],[39,1,39,4],[40,1,40,4],[48,33,49,33],[49,8,49,10],[49,22,49,26],[49,27,49,29],[47,1,47,4],[26,37,26,39],[35,1,35,4],[27,1,27,4],[27,37,27,39],[28,1,28,4],[28,37,28,39],[29,1,29,4],[29,37,29,39],[30,1,30,4],[31,1,31,4],[32,1,32,4],[33,1,33,4],[34,1,34,4],[26,1,26,4],[23,37,23,39],[24,1,24,4],[24,37,24,39],[25,1,25,4],[25,37,25,39],[23,1,23,4],[21,37,21,39],[22,1,22,4],[22,37,22,39],[20,1,20,4],[20,37,20,39],[21,1,21,4],[16,37,18,39],[17,1,17,4],[18,1,18,4],[19,1,19,4],[6,31,7,31],[8,1,8,4],[8,33,47,33],[9,1,9,4],[10,1,10,4],[11,1,11,4],[12,1,12,4],[13,1,13,4],[14,1,14,4],[15,1,15,4],[16,1,16,4],[19,37,19,39],[0,33,0,34],[1,0,1,31],[2,0,2,31],[3,0,3,2],[3,3,3,12],[3,24,3,27],[3,28,3,31],[0,0,0,31],[5,0,5,31],[4,3,4,32],[50,22,50,26],[50,27,50,29],[51,22,51,26],[48,24,48,27],[48,30,48,31],[6,0,7,0],[6,1,7,3],[6,28,7,28],[6,29,7,29],[6,30,7,30],[45,1,45,4],[46,1,46,4],[49,4,49,7],[6,32,7,32],[54,22,54,26],[54,27,54,29],[51,27,51,29],[52,22,52,26],[52,27,52,29],[53,22,53,26],[53,27,53,29]]}
[null,null,null,null,null,null,null,null,null,null,null,null,null,null,null,null,null,null,null,null,null,null,null,null,null,null,null,null,null,null,null,null,null,"ASISTENCIAS E INASISTENCIAS",null,"AZUL"]
[null,null,null,null,null,null,null,null,null,null,null,null,null,null,null,null,null,null,null,null,null,null,null,null,null,null,null,null,null,null,null,null,null,"Presente","P"]
[{"$f":"AL22","v":"REGISTRO DE ASISTENCIA ABRIL  2019"},null,null,null,null,null,null,null,null,null,null,null,null,null,null,null,null,null,null,null,null,null,null,null,null,null,null,null,null,null,null,null,null,"Atraso","A"]
[{"$f":"+UPPER(CARATULA!C20)","v":"MAESTRA (O):"},null,null,{"$f":"CARATULA!E20","v":0},null,null,null,null,null,null,null,null,null,null,null,null,null,null,null,null,null,null,null,null,"TURNO: ",null,null,null,{"$f":"CARATULA!E13","v":0},null,null,null,null,"falta con licencia","F"]
["PARALELO:",null,null,{"$f":"CARATULA!E14","v":0},null,null,null,null,null,null,null,null,null,null,null,null,null,null,null,null,null,null,null,null,null,null,null,null,null,null,null,null,null,"Falta sin licencia","L"]
[{"$f":"+CONCATENATE(\"AÑO DE ESCOLARIDAD:  \",CARATULA!E21)","v":"AÑO DE ESCOLARIDAD:  "}]
["Nº","NÓMINA",null,null,"DÍA","L","M","M","J","V","L","M","M","J","V","L","M","M","J","V","L",{"$f":"IF(F8=7,\"\",\"M\")","v":"M"},{"$f":"IF(V8>27,\"\",\"M\")","v":"M"},{"$f":"IF(W8>27,\"\",\"J\")","v":"J"},{"$f":"IF(X8>27,\"\",\"V\")","v":"V"},"L",{"$f":"IF(K8=7,\"\",\"M\")","v":"M"},"M","LICENCIA (L)","FALTA (F)","ATRASO (A)","PRESENTE (P)","DÍAS TRABAJADOS","dias materias tecnicas",0]
[null,null,null,null,"FECHA",1,{"$f":"F8+1","v":2},{"$f":"G8+1","v":3},{"$f":"H8+1","v":4},{"$f":"I8+1","v":5},{"$f":"J8+3","v":8},{"$f":"K8+1","v":9},{"$f":"L8+1","v":10},{"$f":"M8+1","v":11},{"$f":"N8+1","v":12},{"$f":"O8+3","v":15},{"$f":"P8+1","v":16},{"$f":"Q8+1","v":17},{"$f":"R8+1","v":18},{"$f":"S8+1","v":19},{"$f":"T8+3","v":22},{"$f":"U8+1","v":23},24,25,26,{"$f":"Y8+3","v":29},30,{"$f":"IF($AH$9=\"FEBRERO\",\"\",AA8+1)","v":31}]
[1,{"$f":"CONCATENATE(FILIACION_ESTUDIANTE!B8,\"  \",FILIACION_ESTUDIANTE!C8,\"  \",FILIACION_ESTUDIANTE!D8)","v":"    "},null,null,null,null,null,null,null,null,null,null,null,null,null,null,null,null,null,null,null,null,null,null,null,null,null,null,{"$f":"COUNTIF(F9:AB9,\"L\")","v":0},{"$f":"COUNTIF((F9:AB9),\"F\")","v":0},{"$f":"COUNTIF((F9:AB9),\"A\")","v":0},{"$f":"COUNTIF((F9:AB9),\"P\")","v":0},{"$f":"ROUND(SUM(AC9:AF9),)","v":0},"ABRIL"]
[2,{"$f":"CONCATENATE(FILIACION_ESTUDIANTE!B9,\"  \",FILIACION_ESTUDIANTE!C9,\"  \",FILIACION_ESTUDIANTE!D9)","v":"    "},null,null,null,null,null,null,null,null,null,null,null,null,null,null,null,null,null,null,null,null,null,null,null,null,null,null,{"$f":"COUNTIF(F10:AB10,\"L\")","v":0},{"$f":"COUNTIF((F10:AB10),\"F\")","v":0},{"$f":"COUNTIF((F10:AB10),\"A\")","v":0},{"$f":"COUNTIF((F10:AB10),\"P\")","v":0},0]
[3,{"$f":"CONCATENATE(FILIACION_ESTUDIANTE!B10,\"  \",FILIACION_ESTUDIANTE!C10,\"  \",FILIACION_ESTUDIANTE!D10)","v":"    "},null,null,null,null,null,null,null,null,null,null,null,null,null,null,null,null,null,null,null,null,null,null,null,null,null,null,0,0,0,0,0]
[4,{"$f":"CONCATENATE(FILIACION_ESTUDIANTE!B11,\"  \",FILIACION_ESTUDIANTE!C11,\"  \",FILIACION_ESTUDIANTE!D11)","v":"    "},null,null,null,null,null,null,null,null,null,null,null,null,null,null,null,null,null,null,null,null,null,null,null,null,null,null,0,0,0,0,0,null,null,null,null,null,null,null,null,null,null,null,null,null,null,null,null,null,null,{"$f":"ISLOGICAL((#REF!))","v":false},1]
[5,{"$f":"CONCATENATE(FILIACION_ESTUDIANTE!B12,\"  \",FILIACION_ESTUDIANTE!C12,\"  \",FILIACION_ESTUDIANTE!D12)","v":"    "},null,null,null,null,null,null,null,null,null,null,null,null,null,null,null,null,null,null,null,null,null,null,null,null,null,null,0,0,0,0,0,null,null,null,null,null,null,null,null,null,null,null,null,null,null,null,null,null,null,null,"A"]
[6,{"$f":"CONCATENATE(FILIACION_ESTUDIANTE!B13,\"  \",FILIACION_ESTUDIANTE!C13,\"  \",FILIACION_ESTUDIANTE!D13)","v":"    "},null,null,null,null,null,null,null,null,null,null,null,null,null,null,null,null,null,null,null,null,null,null,null,null,null,null,0,0,0,0,0,null,null,null,null,null,null,null,null,null,null,null,null,null,null,null,null,null,{"$f":"ISTEXT(#REF!)","v":false}]
[7,{"$f":"CONCATENATE(FILIACION_ESTUDIANTE!B14,\"  \",FILIACION_ESTUDIANTE!C14,\"  \",FILIACION_ESTUDIANTE!D14)","v":"    "},null,null,null,null,null,null,null,null,null,null,null,null,null,null,null,null,null,null,null,null,null,null,null,null,null,null,0,0,0,0,0,null,null,null,null,null,null,null,null,null,null,null,null,null,null,null,null,null,null,null,"a"]
[8,{"$f":"CONCATENATE(FILIACION_ESTUDIANTE!B15,\"  \",FILIACION_ESTUDIANTE!C15,\"  \",FILIACION_ESTUDIANTE!D15)","v":"    "},null,null,null,null,null,null,null,null,null,null,null,null,null,null,null,null,null,null,null,null,null,null,null,null,null,null,0,0,0,0,0,null,null,null,null,null,null,null,null,null,null,null,null,null,null,null,null,null,null,null,"a"]
[9,{"$f":"CONCATENATE(FILIACION_ESTUDIANTE!B16,\"  \",FILIACION_ESTUDIANTE!C16,\"  \",FILIACION_ESTUDIANTE!D16)","v":"    "},null,null,null,null,null,null,null,null,null,null,null,null,null,null,null,null,null,null,null,null,null,null,null,null,null,null,0,0,0,0,0,null,null,null,null,"ENCABEZADO DE LOS FORMULARIOS DE CONTROL DE ASISTENCIA",null,null,null,null,null,null,null,null,null,null,null,{"$f":"MONTH(AX18)","v":2},null,null,"f"]
[10,{"$f":"CONCATENATE(FILIACION_ESTUDIANTE!B17,\"  \",FILIACION_ESTUDIANTE!C17,\"  \",FILIACION_ESTUDIANTE!D17)","v":"    "},null,null,null,null,null,null,null,null,null,null,null,null,null,null,null,null,null,null,null,null,null,null,null,null,null,null,0,0,0,0,0,null,null,null,null,null,null,null,null,null,null,null,null,null,null,null,null,"2010-02-01",null,null,"f"]
[11,{"$f":"CONCATENATE(FILIACION_ESTUDIANTE!B18,\"  \",FILIACION_ESTUDIANTE!C18,\"  \",FILIACION_ESTUDIANTE!D18)","v":"    "},null,null,null,null,null,null,null,null,null,null,null,null,null,null,null,null,null,null,null,null,null,null,null,null,null,null,0,0,0,0,0,null,null,null,null,null,null,null,null,null,null,null,null,null,null,null,null,null,null,null,"f"]
[12,{"$f":"CONCATENATE(FILIACION_ESTUDIANTE!B19,\"  \",FILIACION_ESTUDIANTE!C19,\"  \",FILIACION_ESTUDIANTE!D19)","v":"    "},null,null,null,null,null,null,null,null,null,null,null,null,null,null,null,null,null,null,null,null,null,null,null,null,null,null,0,0,0,0,0,null,null,null,null,{"$f":"CONCATENATE(AO20,\" \",AP20)","v":"REGISTRO DE ASISTENCIA FEBRERO  2019"},null,null,"REGISTRO DE ASISTENCIA FEBRERO ",{"$f":"CARATULA!F26","v":2019},null,null,null,null,null,null,null,null,null,null,"p"]
[13,{"$f":"CONCATENATE(FILIACION_ESTUDIANTE!B20,\"  \",FILIACION_ESTUDIANTE!C20,\"  \",FILIACION_ESTUDIANTE!D20)","v":"    "},null,null,null,null,null,null,null,null,null,null,null,null,null,null,null,null,null,null,null,null,null,null,null,null,null,null,0,0,0,0,0,null,null,null,null,{"$f":"CONCATENATE(AO21,\" \",AP21)","v":"REGISTRO DE ASISTENCIA MARZO  2019"},null,null,"REGISTRO DE ASISTENCIA MARZO ",{"$f":"AP20","v":2019},null,null,null,null,null,null,null,null,null,null,"y"]
[14,{"$f":"CONCATENATE(FILIACION_ESTUDIANTE!B21,\"  \",FILIACION_ESTUDIANTE!C21,\"  \",FILIACION_ESTUDIANTE!D21)","v":"    "},null,null,null,null,null,null,null,null,null,null,null,null,null,null,null,null,null,null,null,null,null,null,null,null,null,null,0,0,0,0,0,null,null,null,null,"REGISTRO DE ASISTENCIA ABRIL  2019",null,null,"REGISTRO DE ASISTENCIA ABRIL ",{"$f":"AP21","v":2019},null,null,null,null,null,null,null,null,null,null,"a"]
[15,{"$f":"CONCATENATE(FILIACION_ESTUDIANTE!B22,\"  \",FILIACION_ESTUDIANTE!C22,\"  \",FILIACION_ESTUDIANTE!D22)","v":"    "},null,null,null,null,null,null,null,null,null,null,null,null,null,null,null,null,null,null,null,null,null,null,null,null,null,null,0,0,0,0,0,null,null,null,null,"REGISTRO DE ASISTENCIA MAYO  2019",null,null,"REGISTRO DE ASISTENCIA MAYO ",{"$f":"AP22","v":2019},null,null,null,null,null,null,null,null,null,null,"a"]
[16,{"$f":"CONCATENATE(FILIACION_ESTUDIANTE!B23,\"  \",FILIACION_ESTUDIANTE!C23,\"  \",FILIACION_ESTUDIANTE!D23)","v":"    "},null,null,null,null,null,null,null,null,null,null,null,null,null,null,null,null,null,null,null,null,null,null,null,null,null,null,0,0,0,0,0,null,null,null,null,"REGISTRO DE ASISTENCIA JUNIO  2019",null,null,"REGISTRO DE ASISTENCIA JUNIO ",2019,null,null,null,null,null,null,null,null,null,null,"a"]
[17,{"$f":"CONCATENATE(FILIACION_ESTUDIANTE!B24,\"  \",FILIACION_ESTUDIANTE!C24,\"  \",FILIACION_ESTUDIANTE!D24)","v":"    "},null,null,null,null,null,null,null,null,null,null,null,null,null,null,null,null,null,null,null,null,null,null,null,null,null,null,0,0,0,0,0,null,null,null,null,"REGISTRO DE ASISTENCIA JULIO  2019",null,null,"REGISTRO DE ASISTENCIA JULIO ",2019,null,null,null,null,null,null,null,null,null,null,"a"]
[18,{"$f":"CONCATENATE(FILIACION_ESTUDIANTE!B25,\"  \",FILIACION_ESTUDIANTE!C25,\"  \",FILIACION_ESTUDIANTE!D25)","v":"    "},null,null,null,null,null,null,null,null,null,null,null,null,null,null,null,null,null,null,null,null,null,null,null,null,null,null,0,0,0,0,0,null,null,null,null,"REGISTRO DE ASISTENCIA AGOSTO  2019",null,null,"REGISTRO DE ASISTENCIA AGOSTO ",2019,null,null,null,null,null,null,null,null,null,null,"a"]
[19,{"$f":"CONCATENATE(FILIACION_ESTUDIANTE!B26,\"  \",FILIACION_ESTUDIANTE!C26,\"  \",FILIACION_ESTUDIANTE!D26)","v":"    "},null,null,null,null,null,null,null,null,null,null,null,null,null,null,null,null,null,null,null,null,null,null,null,null,null,null,0,0,0,0,0,null,null,null,null,"REGISTRO DE ASISTENCIA SEPTIEMBRE  2019",null,null,"REGISTRO DE ASISTENCIA SEPTIEMBRE ",2019,null,null,null,null,null,null,null,null,null,null,"a"]
[20,{"$f":"CONCATENATE(FILIACION_ESTUDIANTE!B27,\"  \",FILIACION_ESTUDIANTE!C27,\"  \",FILIACION_ESTUDIANTE!D27)","v":"    "},null,null,null,null,null,null,null,null,null,null,null,null,null,null,null,null,null,null,null,null,null,null,null,null,null,null,0,0,0,0,0,null,null,null,null,"REGISTRO DE ASISTENCIA OCTUBRE  2019",null,null,"REGISTRO DE ASISTENCIA OCTUBRE ",2019,null,null,null,null,null,null,null,null,null,null,"f"]
[21,{"$f":"CONCATENATE(FILIACION_ESTUDIANTE!B28,\"  \",FILIACION_ESTUDIANTE!C28,\"  \",FILIACION_ESTUDIANTE!D28)","v":"    "},null,null,null,null,null,null,null,null,null,null,null,null,null,null,null,null,null,null,null,null,null,null,null,null,null,null,0,0,0,0,0,null,null,null,null,"REGISTRO DE ASISTENCIA NOVIEMBRE  2019",null,null,"REGISTRO DE ASISTENCIA NOVIEMBRE ",2019,null,null,null,null,null,null,null,null,null,null,"p"]
[22,{"$f":"CONCATENATE(FILIACION_ESTUDIANTE!B29,\"  \",FILIACION_ESTUDIANTE!C29,\"  \",FILIACION_ESTUDIANTE!D29)","v":"    "},null,null,null,null,null,null,null,null,null,null,null,null,null,null,null,null,null,null,null,null,null,null,null,null,null,null,0,0,0,0,0,null,null,null,null,"REGISTRO DE ASISTENCIA DICIEMBRE  2019",null,null,"REGISTRO DE ASISTENCIA DICIEMBRE ",2019,null,null,null,null,null,null,null,null,null,null,"M"]
[23,{"$f":"CONCATENATE(FILIACION_ESTUDIANTE!B30,\"  \",FILIACION_ESTUDIANTE!C30,\"  \",FILIACION_ESTUDIANTE!D30)","v":"    "},null,null,null,null,null,null,null,null,null,null,null,null,null,null,null,null,null,null,null,null,null,null,null,null,null,null,0,0,0,0,0]
[24,{"$f":"CONCATENATE(FILIACION_ESTUDIANTE!B31,\"  \",FILIACION_ESTUDIANTE!C31,\"  \",FILIACION_ESTUDIANTE!D31)","v":"    "},null,null,null,null,null,null,null,null,null,null,null,null,null,null,null,null,null,null,null,null,null,null,null,null,null,null,0,0,0,0,0,null,null,null,null,null,null,null,null,null,null,null,null,null,null,null,null,null,null,null,"M"]
[25,{"$f":"CONCATENATE(FILIACION_ESTUDIANTE!B32,\"  \",FILIACION_ESTUDIANTE!C32,\"  \",FILIACION_ESTUDIANTE!D32)","v":"    "},null,null,null,null,null,null,null,null,null,null,null,null,null,null,null,null,null,null,null,null,null,null,null,null,null,null,0,0,0,0,0,null,null,null,null,null,null,null,null,null,null,null,null,null,null,null,null,null,null,null,"M",null,null,null,null,null,{"$f":"CARATULA!E14","v":0}]
[26,{"$f":"CONCATENATE(FILIACION_ESTUDIANTE!B33,\"  \",FILIACION_ESTUDIANTE!C33,\"  \",FILIACION_ESTUDIANTE!D33)","v":"    "},null,null,null,null,null,null,null,null,null,null,null,null,null,null,null,null,null,null,null,null,null,null,null,null,null,null,0,0,0,0,0,null,null,null,null,null,null,null,null,null,null,null,null,null,null,null,null,null,null,null,"M"]
[27,{"$f":"CONCATENATE(FILIACION_ESTUDIANTE!B34,\"  \",FILIACION_ESTUDIANTE!C34,\"  \",FILIACION_ESTUDIANTE!D34)","v":"    "},null,null,null,null,null,null,null,null,null,null,null,null,null,null,null,null,null,null,null,null,null,null,null,null,null,null,0,0,0,0,0,null,null,null,null,null,null,null,null,null,null,null,null,null,null,null,null,null,null,null,"M"]
[28,{"$f":"CONCATENATE(FILIACION_ESTUDIANTE!B35,\"  \",FILIACION_ESTUDIANTE!C35,\"  \",FILIACION_ESTUDIANTE!D35)","v":"    "},null,null,null,null,null,null,null,null,null,null,null,null,null,null,null,null,null,null,null,null,null,null,null,null,null,null,0,0,0,0,0,null,null,null,null,null,null,null,null,null,null,null,null,null,null,null,null,null,null,null,"M"]
[29,{"$f":"CONCATENATE(FILIACION_ESTUDIANTE!B36,\"  \",FILIACION_ESTUDIANTE!C36,\"  \",FILIACION_ESTUDIANTE!D36)","v":"    "},null,null,null,null,null,null,null,null,null,null,null,null,null,null,null,null,null,null,null,null,null,null,null,null,null,null,0,0,0,0,0]
[30,{"$f":"CONCATENATE(FILIACION_ESTUDIANTE!B37,\"  \",FILIACION_ESTUDIANTE!C37,\"  \",FILIACION_ESTUDIANTE!D37)","v":"    "},null,null,null,null,null,null,null,null,null,null,null,null,null,null,null,null,null,null,null,null,null,null,null,null,null,null,0,0,0,0,0]
[31,{"$f":"CONCATENATE(FILIACION_ESTUDIANTE!B38,\"  \",FILIACION_ESTUDIANTE!C38,\"  \",FILIACION_ESTUDIANTE!D38)","v":"    "},null,null,null,null,null,null,null,null,null,null,null,null,null,null,null,null,null,null,null,null,null,null,null,null,null,null,0,0,0,0,0,null,null,null,null,null,null,null,null,null,null,null,null,null,null,null,null,null,null,null,"M"]
[32,{"$f":"CONCATENATE(FILIACION_ESTUDIANTE!B39,\"  \",FILIACION_ESTUDIANTE!C39,\"  \",FILIACION_ESTUDIANTE!D39)","v":"    "},null,null,null,null,null,null,null,null,null,null,null,null,null,null,null,null,null,null,null,null,null,null,null,null,null,null,0,0,0,0,0,null,null,null,null,null,null,null,null,null,null,null,null,null,null,null,null,null,null,null,"M"]
[33,{"$f":"CONCATENATE(FILIACION_ESTUDIANTE!B40,\"  \",FILIACION_ESTUDIANTE!C40,\"  \",FILIACION_ESTUDIANTE!D40)","v":"    "},null,null,null,null,null,null,null,null,null,null,null,null,null,null,null,null,null,null,null,null,null,null,null,null,null,null,0,0,0,0,0]
[34,{"$f":"CONCATENATE(FILIACION_ESTUDIANTE!B41,\"  \",FILIACION_ESTUDIANTE!C41,\"  \",FILIACION_ESTUDIANTE!D41)","v":"    "},null,null,null,null,null,null,null,null,null,null,null,null,null,null,null,null,null,null,null,null,null,null,null,null,null,null,0,0,0,0,0]
[35,{"$f":"CONCATENATE(FILIACION_ESTUDIANTE!B42,\"  \",FILIACION_ESTUDIANTE!C42,\"  \",FILIACION_ESTUDIANTE!D42)","v":"    "},null,null,null,null,null,null,null,null,null,null,null,null,null,null,null,null,null,null,null,null,null,null,null,null,null,null,0,0,0,0,0]
[36,{"$f":"CONCATENATE(FILIACION_ESTUDIANTE!B43,\"  \",FILIACION_ESTUDIANTE!C43,\"  \",FILIACION_ESTUDIANTE!D43)","v":"    "},null,null,null,null,null,null,null,null,null,null,null,null,null,null,null,null,null,null,null,null,null,null,null,null,null,null,0,0,0,0,0]
[37,{"$f":"CONCATENATE(FILIACION_ESTUDIANTE!B44,\"  \",FILIACION_ESTUDIANTE!C44,\"  \",FILIACION_ESTUDIANTE!D44)","v":"    "},null,null,null,null,null,null,null,null,null,null,null,null,null,null,null,null,null,null,null,null,null,null,null,null,null,null,0,0,0,0,0]
[38,{"$f":"CONCATENATE(FILIACION_ESTUDIANTE!B45,\"  \",FILIACION_ESTUDIANTE!C45,\"  \",FILIACION_ESTUDIANTE!D45)","v":"    "},null,null,null,null,null,null,null,null,null,null,null,null,null,null,null,null,null,null,null,null,null,null,null,null,null,null,0,0,0,0,0]
[39,{"$f":"CONCATENATE(FILIACION_ESTUDIANTE!B46,\"  \",FILIACION_ESTUDIANTE!C46,\"  \",FILIACION_ESTUDIANTE!D46)","v":"    "},null,null,null,null,null,null,null,null,null,null,null,null,null,null,null,null,null,null,null,null,null,null,null,null,null,null,0,0,0,0,0]
[40,{"$f":"CONCATENATE(FILIACION_ESTUDIANTE!B47,\"  \",FILIACION_ESTUDIANTE!C47,\"  \",FILIACION_ESTUDIANTE!D47)","v":"    "},null,null,null,null,null,null,null,null,null,null,null,null,null,null,null,null,null,null,null,null,null,null,null,null,null,null,0,0,0,0,0]
[null,null,null,null,null,null,null,null,null,null,null,null,null,null,null,null,null,null,null,null,null,null,null,null,"TOTAL",null,null,null,{"$f":"SUM(AC9:AC48)","v":0},{"$f":"SUM(AD9:AD48)","v":0},{"$f":"SUM(AE9:AF48)","v":0},null,{"$f":"SUM(AG9:AG48)","v":0}]
[null,null,null,null,null,null,null,null,null,null,null,null,null,null,null,null,null,null,null,null,null,null,null,null,null,null,null,null,null,null,null,null,null,null,null,{"$f":"(SUM(AF9:AF48,AC9:AD48)/#REF!)","v":{"$error":"#REF!"}},"SUMATORIA","DIAS TRAB","PROMEDIO"]
[null,null,null,null,null,null,null,null,null,null,null,null,null,null,null,null,null,null,null,null,null,null,null,null,null,null,null,"%"]
[null,null,null,null,null,null,null,null,null,null,null,null,null,null,null,null,null,null,null,null,null,null,"LICENCIA",null,null,null,null,{"$f":"IFERROR(AC49/AG49,\"\")","v":""}]
[null,null,null,null,null,null,null,null,null,null,null,null,null,null,null,null,null,null,null,null,null,null,"FALTA",null,null,null,null,{"$f":"IFERROR(AD49/AG49,)","v":0}]
[null,null,null,null,null,null,null,null,null,null,null,null,null,null,null,null,null,null,null,null,null,null,"PRESENTE",null,null,null,null,{"$f":"IFERROR(AE49/AG49,)","v":0}]
[null,null,null,null,null,null,null,null,null,null,null,null,null,null,null,null,null,null,null,null,null,null,"TOTAL %",null,null,null,null,{"$f":"SUM(AB52:AD54)","v":0}]

{"sheet":"MAYO","index":12,"n_rows":55,"n_cols":53,"rows_kept":55,"cut":false,"hidden":false,"merged":[[42,1,42,4],[43,1,43,4],[44,1,44,4],[37,1,37,4],[38,1,38,4],[39,1,39,4],[40,1,40,4],[41,1,41,4],[48,33,49,33],[49,8,49,10],[49,22,49,26],[49,27,49,29],[47,1,47,4],[26,37,26,39],[35,1,35,4],[27,1,27,4],[27,37,27,39],[28,1,28,4],[28,37,28,39],[29,1,29,4],[29,37,29,39],[30,1,30,4],[31,1,31,4],[32,1,32,4],[33,1,33,4],[34,1,34,4],[26,1,26,4],[23,37,23,39],[24,1,24,4],[24,37,24,39],[25,1,25,4],[25,37,25,39],[23,1,23,4],[21,37,21,39],[22,1,22,4],[22,37,22,39],[20,1,20,4],[20,37,20,39],[21,1,21,4],[16,37,18,39],[17,1,17,4],[18,1,18,4],[19,1,19,4],[6,31,7,31],[8,1,8,4],[8,33,47,33],[9,1,9,4],[10,1,10,4],[11,1,11,4],[12,1,12,4],[13,1,13,4],[14,1,14,4],[15,1,15,4],[16,1,16,4],[19,37,19,39],[0,33,0,34],[1,0,1,31],[2,0,2,31],[3,0,3,2],[3,3,3,12],[3,24,3,27],[3,28,3,31],[0,0,0,31],[5,0,5,31],[4,3,4,32],[48,24,48,27],[48,30,48,31],[50,22,50,26],[50,27,50,29],[6,0,7,0],[6,1,7,3],[6,28,7,28],[6,29,7,29],[6,30,7,30],[45,1,45,4],[46,1,46,4],[49,4,49,7],[6,32,7,32],[36,1,36,4],[54,22,54,26],[54,27,54,29],[51,22,51,26],[51,27,51,29],[52,22,52,26],[52,27,52,29],[53,22,53,26],[53,27,53,29]]}
[null,null,null,null,null,null,null,null,null,null,null,null,null,null,null,null,null,null,null,null,null,null,null,null,null,null,null,null,null,null,null,null,null,"ASISTENCIAS E INASISTENCIAS",null,"AZUL"]
[null,null,null,null,null,null,null,null,null,null,null,null,null,null,null,null,null,null,null,null,null,null,null,null,null,null,null,null,null,null,null,null,null,"Presente","P"]
[{"$f":"AL23","v":"REGISTRO DE ASISTENCIA MAYO  2019"},null,null,null,null,null,null,null,null,null,null,null,null,null,null,null,null,null,null,null,null,null,null,null,null,null,null,null,null,null,null,null,null,"Atraso","A"]
[{"$f":"+UPPER(CARATULA!C20)","v":"MAESTRA (O):"},null,null,{"$f":"CARATULA!E20","v":0},null,null,null,null,null,null,null,null,null,null,null,null,null,null,null,null,null,null,null,null,"TURNO: ",null,null,null,{"$f":"CARATULA!E13","v":0},null,null,null,null,"falta con licencia","F"]
["PARALELO:",null,null,{"$f":"CARATULA!E14","v":0},null,null,null,null,null,null,null,null,null,null,null,null,null,null,null,null,null,null,null,null,null,null,null,null,null,null,null,null,null,"Falta sin licencia","L"]
[{"$f":"+CONCATENATE(\"AÑO DE ESCOLARIDAD:  \",CARATULA!E21)","v":"AÑO DE ESCOLARIDAD:  "}]
["Nº","NÓMINA",null,null,"DÍA","M","J","V","L","M","M","J","V","L","M","M","J","V","L","M","M","J","V","L","M","M","J","V","LICENCIA (L)","FALTA (F)","ATRASO (A)","PRESENTE (P)","DÍAS TRABAJADOS","dias materias tecnicas",0]
[null,null,null,null,"FECHA",1,{"$f":"+F8+1","v":2},{"$f":"+G8+1","v":3},{"$f":"+H8+3","v":6},7,8,9,10,{"$f":"+M8+3","v":13},14,15,16,17,{"$f":"+R8+3","v":20},21,22,23,24,{"$f":"+W8+3","v":27},28,29,30,31]
[1,{"$f":"CONCATENATE(FILIACION_ESTUDIANTE!B8,\"  \",FILIACION_ESTUDIANTE!C8,\"  \",FILIACION_ESTUDIANTE!D8)","v":"    "},null,null,null,null,null,null,null,null,null,null,null,null,null,null,null,null,null,null,null,null,null,null,null,null,null,null,{"$f":"COUNTIF(F9:AB9,\"L\")","v":0},{"$f":"COUNTIF((F9:AB9),\"F\")","v":0},{"$f":"COUNTIF((F9:AB9),\"A\")","v":0},{"$f":"COUNTIF((F9:AB9),\"P\")","v":0},{"$f":"ROUND(SUM(AC9:AF9),)","v":0},"MAYO"]
[2,{"$f":"CONCATENATE(FILIACION_ESTUDIANTE!B9,\"  \",FILIACION_ESTUDIANTE!C9,\"  \",FILIACION_ESTUDIANTE!D9)","v":"    "},null,null,null,null,null,null,null,null,null,null,null,null,null,null,null,null,null,null,null,null,null,null,null,null,null,null,{"$f":"COUNTIF(F10:AB10,\"L\")","v":0},{"$f":"COUNTIF((F10:AB10),\"F\")","v":0},{"$f":"COUNTIF((F10:AB10),\"A\")","v":0},{"$f":"COUNTIF((F10:AB10),\"P\")","v":0},0]
[3,{"$f":"CONCATENATE(FILIACION_ESTUDIANTE!B10,\"  \",FILIACION_ESTUDIANTE!C10,\"  \",FILIACION_ESTUDIANTE!D10)","v":"    "},null,null,null,null,null,null,null,null,null,null,null,null,null,null,null,null,null,null,null,null,null,null,null,null,null,null,0,0,0,0,0]
[4,{"$f":"CONCATENATE(FILIACION_ESTUDIANTE!B11,\"  \",FILIACION_ESTUDIANTE!C11,\"  \",FILIACION_ESTUDIANTE!D11)","v":"    "},null,null,null,null,null,null,null,null,null,null,null,null,null,null,null,null,null,null,null,null,null,null,null,null,null,null,0,0,0,0,0,null,null,null,null,null,null,null,null,null,null,null,null,null,null,null,null,null,null,{"$f":"ISLOGICAL((#REF!))","v":false},1]
[5,{"$f":"CONCATENATE(FILIACION_ESTUDIANTE!B12,\"  \",FILIACION_ESTUDIANTE!C12,\"  \",FILIACION_ESTUDIANTE!D12)","v":"    "},null,null,null,null,null,null,null,null,null,null,null,null,null,null,null,null,null,null,null,null,null,null,null,null,null,null,0,0,0,0,0,null,null,null,null,null,null,null,null,null,null,null,null,null,null,null,null,null,null,null,"A"]
[6,{"$f":"CONCATENATE(FILIACION_ESTUDIANTE!B13,\"  \",FILIACION_ESTUDIANTE!C13,\"  \",FILIACION_ESTUDIANTE!D13)","v":"    "},null,null,null,null,null,null,null,null,null,null,null,null,null,null,null,null,null,null,null,null,null,null,null,null,null,null,0,0,0,0,0,null,null,null,null,null,null,null,null,null,null,null,null,null,null,null,null,null,{"$f":"ISTEXT(#REF!)","v":false}]
[7,{"$f":"CONCATENATE(FILIACION_ESTUDIANTE!B14,\"  \",FILIACION_ESTUDIANTE!C14,\"  \",FILIACION_ESTUDIANTE!D14)","v":"    "},null,null,null,null,null,null,null,null,null,null,null,null,null,null,null,null,null,null,null,null,null,null,null,null,null,null,0,0,0,0,0,null,null,null,null,null,null,null,null,null,null,null,null,null,null,null,null,null,null,null,"a"]
[8,{"$f":"CONCATENATE(FILIACION_ESTUDIANTE!B15,\"  \",FILIACION_ESTUDIANTE!C15,\"  \",FILIACION_ESTUDIANTE!D15)","v":"    "},null,null,null,null,null,null,null,null,null,null,null,null,null,null,null,null,null,null,null,null,null,null,null,null,null,null,0,0,0,0,0,null,null,null,null,null,null,null,null,null,null,null,null,null,null,null,null,null,null,null,"a"]
[9,{"$f":"CONCATENATE(FILIACION_ESTUDIANTE!B16,\"  \",FILIACION_ESTUDIANTE!C16,\"  \",FILIACION_ESTUDIANTE!D16)","v":"    "},null,null,null,null,null,null,null,null,null,null,null,null,null,null,null,null,null,null,null,null,null,null,null,null,null,null,0,0,0,0,0,null,null,null,null,"ENCABEZADO DE LOS FORMULARIOS DE CONTROL DE ASISTENCIA",null,null,null,null,null,null,null,null,null,null,null,{"$f":"MONTH(AX18)","v":2},null,null,"f"]
[10,{"$f":"CONCATENATE(FILIACION_ESTUDIANTE!B17,\"  \",FILIACION_ESTUDIANTE!C17,\"  \",FILIACION_ESTUDIANTE!D17)","v":"    "},null,null,null,null,null,null,null,null,null,null,null,null,null,null,null,null,null,null,null,null,null,null,null,null,null,null,0,0,0,0,0,null,null,null,null,null,null,null,null,null,null,null,null,null,null,null,null,"2010-02-01",null,null,"f"]
[11,{"$f":"CONCATENATE(FILIACION_ESTUDIANTE!B18,\"  \",FILIACION_ESTUDIANTE!C18,\"  \",FILIACION_ESTUDIANTE!D18)","v":"    "},null,null,null,null,null,null,null,null,null,null,null,null,null,null,null,null,null,null,null,null,null,null,null,null,null,null,0,0,0,0,0,null,null,null,null,null,null,null,null,null,null,null,null,null,null,null,null,null,null,null,"f"]
[12,{"$f":"CONCATENATE(FILIACION_ESTUDIANTE!B19,\"  \",FILIACION_ESTUDIANTE!C19,\"  \",FILIACION_ESTUDIANTE!D19)","v":"    "},null,null,null,null,null,null,null,null,null,null,null,null,null,null,null,null,null,null,null,null,null,null,null,null,null,null,0,0,0,0,0,null,null,null,null,{"$f":"CONCATENATE(AO20,\" \",AP20)","v":"REGISTRO DE ASISTENCIA FEBRERO  2019"},null,null,"REGISTRO DE ASISTENCIA FEBRERO ",{"$f":"CARATULA!F26","v":2019},null,null,null,null,null,null,null,null,null,null,"p"]
[13,{"$f":"CONCATENATE(FILIACION_ESTUDIANTE!B20,\"  \",FILIACION_ESTUDIANTE!C20,\"  \",FILIACION_ESTUDIANTE!D20)","v":"    "},null,null,null,null,null,null,null,null,null,null,null,null,null,null,null,null,null,null,null,null,null,null,null,null,null,null,0,0,0,0,0,null,null,null,null,{"$f":"CONCATENATE(AO21,\" \",AP21)","v":"REGISTRO DE ASISTENCIA MARZO  2019"},null,null,"REGISTRO DE ASISTENCIA MARZO ",{"$f":"AP20","v":2019},null,null,null,null,null,null,null,null,null,null,"y"]
[14,{"$f":"CONCATENATE(FILIACION_ESTUDIANTE!B21,\"  \",FILIACION_ESTUDIANTE!C21,\"  \",FILIACION_ESTUDIANTE!D21)","v":"    "},null,null,null,null,null,null,null,null,null,null,null,null,null,null,null,null,null,null,null,null,null,null,null,null,null,null,0,0,0,0,0,null,null,null,null,"REGISTRO DE ASISTENCIA ABRIL  2019",null,null,"REGISTRO DE ASISTENCIA ABRIL ",{"$f":"AP21","v":2019},null,null,null,null,null,null,null,null,null,null,"a"]
[15,{"$f":"CONCATENATE(FILIACION_ESTUDIANTE!B22,\"  \",FILIACION_ESTUDIANTE!C22,\"  \",FILIACION_ESTUDIANTE!D22)","v":"    "},null,null,null,null,null,null,null,null,null,null,null,null,null,null,null,null,null,null,null,null,null,null,null,null,null,null,0,0,0,0,0,null,null,null,null,"REGISTRO DE ASISTENCIA MAYO  2019",null,null,"REGISTRO DE ASISTENCIA MAYO ",{"$f":"AP22","v":2019},null,null,null,null,null,null,null,null,null,null,"a"]
[16,{"$f":"CONCATENATE(FILIACION_ESTUDIANTE!B23,\"  \",FILIACION_ESTUDIANTE!C23,\"  \",FILIACION_ESTUDIANTE!D23)","v":"    "},null,null,null,null,null,null,null,null,null,null,null,null,null,null,null,null,null,null,null,null,null,null,null,null,null,null,0,0,0,0,0,null,null,null,null,"REGISTRO DE ASISTENCIA JUNIO  2019",null,null,"REGISTRO DE ASISTENCIA JUNIO ",2019,null,null,null,null,null,null,null,null,null,null,"a"]
[17,{"$f":"CONCATENATE(FILIACION_ESTUDIANTE!B24,\"  \",FILIACION_ESTUDIANTE!C24,\"  \",FILIACION_ESTUDIANTE!D24)","v":"    "},null,null,null,null,null,null,null,null,null,null,null,null,null,null,null,null,null,null,null,null,null,null,null,null,null,null,0,0,0,0,0,null,null,null,null,"REGISTRO DE ASISTENCIA JULIO  2019",null,null,"REGISTRO DE ASISTENCIA JULIO ",2019,null,null,null,null,null,null,null,null,null,null,"a"]
[18,{"$f":"CONCATENATE(FILIACION_ESTUDIANTE!B25,\"  \",FILIACION_ESTUDIANTE!C25,\"  \",FILIACION_ESTUDIANTE!D25)","v":"    "},null,null,null,null,null,null,null,null,null,null,null,null,null,null,null,null,null,null,null,null,null,null,null,null,null,null,0,0,0,0,0,null,null,null,null,"REGISTRO DE ASISTENCIA AGOSTO  2019",null,null,"REGISTRO DE ASISTENCIA AGOSTO ",2019,null,null,null,null,null,null,null,null,null,null,"a"]
[19,{"$f":"CONCATENATE(FILIACION_ESTUDIANTE!B26,\"  \",FILIACION_ESTUDIANTE!C26,\"  \",FILIACION_ESTUDIANTE!D26)","v":"    "},null,null,null,null,null,null,null,null,null,null,null,null,null,null,null,null,null,null,null,null,null,null,null,null,null,null,0,0,0,0,0,null,null,null,null,"REGISTRO DE ASISTENCIA SEPTIEMBRE  2019",null,null,"REGISTRO DE ASISTENCIA SEPTIEMBRE ",2019,null,null,null,null,null,null,null,null,null,null,"a"]
[20,{"$f":"CONCATENATE(FILIACION_ESTUDIANTE!B27,\"  \",FILIACION_ESTUDIANTE!C27,\"  \",FILIACION_ESTUDIANTE!D27)","v":"    "},null,null,null,null,null,null,null,null,null,null,null,null,null,null,null,null,null,null,null,null,null,null,null,null,null,null,0,0,0,0,0,null,null,null,null,"REGISTRO DE ASISTENCIA OCTUBRE  2019",null,null,"REGISTRO DE ASISTENCIA OCTUBRE ",2019,null,null,null,null,null,null,null,null,null,null,"f"]
[21,{"$f":"CONCATENATE(FILIACION_ESTUDIANTE!B28,\"  \",FILIACION_ESTUDIANTE!C28,\"  \",FILIACION_ESTUDIANTE!D28)","v":"    "},null,null,null,null,null,null,null,null,null,null,null,null,null,null,null,null,null,null,null,null,null,null,null,null,null,null,0,0,0,0,0,null,null,null,null,"REGISTRO DE ASISTENCIA NOVIEMBRE  2019",null,null,"REGISTRO DE ASISTENCIA NOVIEMBRE ",2019,null,null,null,null,null,null,null,null,null,null,"p"]
[22,{"$f":"CONCATENATE(FILIACION_ESTUDIANTE!B29,\"  \",FILIACION_ESTUDIANTE!C29,\"  \",FILIACION_ESTUDIANTE!D29)","v":"    "},null,null,null,null,null,null,null,null,null,null,null,null,null,null,null,null,null,null,null,null,null,null,null,null,null,null,0,0,0,0,0,null,null,null,null,"REGISTRO DE ASISTENCIA DICIEMBRE  2019",null,null,"REGISTRO DE ASISTENCIA DICIEMBRE ",2019,null,null,null,null,null,null,null,null,null,null,"M"]
[23,{"$f":"CONCATENATE(FILIACION_ESTUDIANTE!B30,\"  \",FILIACION_ESTUDIANTE!C30,\"  \",FILIACION_ESTUDIANTE!D30)","v":"    "},null,null,null,null,null,null,null,null,null,null,null,null,null,null,null,null,null,null,null,null,null,null,null,null,null,null,0,0,0,0,0]
[24,{"$f":"CONCATENATE(FILIACION_ESTUDIANTE!B31,\"  \",FILIACION_ESTUDIANTE!C31,\"  \",FILIACION_ESTUDIANTE!D31)","v":"    "},null,null,null,null,null,null,null,null,null,null,null,null,null,null,null,null,null,null,null,null,null,null,null,null,null,null,0,0,0,0,0,null,null,null,null,null,null,null,null,null,null,null,null,null,null,null,null,null,null,null,"M"]
[25,{"$f":"CONCATENATE(FILIACION_ESTUDIANTE!B32,\"  \",FILIACION_ESTUDIANTE!C32,\"  \",FILIACION_ESTUDIANTE!D32)","v":"    "},null,null,null,null,null,null,null,null,null,null,null,null,null,null,null,null,null,null,null,null,null,null,null,null,null,null,0,0,0,0,0,null,null,null,null,null,null,null,null,null,null,null,null,null,null,null,null,null,null,null,"M"]
[26,{"$f":"CONCATENATE(FILIACION_ESTUDIANTE!B33,\"  \",FILIACION_ESTUDIANTE!C33,\"  \",FILIACION_ESTUDIANTE!D33)","v":"    "},null,null,null,null,null,null,null,null,null,null,null,null,null,null,null,null,null,null,null,null,null,null,null,null,null,null,0,0,0,0,0,null,null,null,null,null,null,null,null,null,null,null,null,null,null,null,null,null,null,null,"M"]
[27,{"$f":"CONCATENATE(FILIACION_ESTUDIANTE!B34,\"  \",FILIACION_ESTUDIANTE!C34,\"  \",FILIACION_ESTUDIANTE!D34)","v":"    "},null,null,null,null,null,null,null,null,null,null,null,null,null,null,null,null,null,null,null,null,null,null,null,null,null,null,0,0,0,0,0,null,null,null,null,null,null,null,null,null,null,null,null,null,null,null,null,null,null,null,"M"]
[28,{"$f":"CONCATENATE(FILIACION_ESTUDIANTE!B35,\"  \",FILIACION_ESTUDIANTE!C35,\"  \",FILIACION_ESTUDIANTE!D35)","v":"    "},null,null,null,null,null,null,null,null,null,null,null,null,null,null,null,null,null,null,null,null,null,null,null,null,null,null,0,0,0,0,0,null,null,null,null,null,null,null,null,null,null,null,null,null,null,null,null,null,null,null,"M"]
[29,{"$f":"CONCATENATE(FILIACION_ESTUDIANTE!B36,\"  \",FILIACION_ESTUDIANTE!C36,\"  \",FILIACION_ESTUDIANTE!D36)","v":"    "},null,null,null,null,null,null,null,null,null,null,null,null,null,null,null,null,null,null,null,null,null,null,null,null,null,null,0,0,0,0,0]
[30,{"$f":"CONCATENATE(FILIACION_ESTUDIANTE!B37,\"  \",FILIACION_ESTUDIANTE!C37,\"  \",FILIACION_ESTUDIANTE!D37)","v":"    "},null,null,null,null,null,null,null,null,null,null,null,null,null,null,null,null,null,null,null,null,null,null,null,null,null,null,0,0,0,0,0]
[31,{"$f":"CONCATENATE(FILIACION_ESTUDIANTE!B38,\"  \",FILIACION_ESTUDIANTE!C38,\"  \",FILIACION_ESTUDIANTE!D38)","v":"    "},null,null,null,null,null,null,null,null,null,null,null,null,null,null,null,null,null,null,null,null,null,null,null,null,null,null,0,0,0,0,0,null,null,null,null,null,null,null,null,null,null,null,null,null,null,null,null,null,null,null,"M"]
[32,{"$f":"CONCATENATE(FILIACION_ESTUDIANTE!B39,\"  \",FILIACION_ESTUDIANTE!C39,\"  \",FILIACION_ESTUDIANTE!D39)","v":"    "},null,null,null,null,null,null,null,null,null,null,null,null,null,null,null,null,null,null,null,null,null,null,null,null,null,null,0,0,0,0,0,null,null,null,null,null,null,null,null,null,null,null,null,null,null,null,null,null,null,null,"M"]
[33,{"$f":"CONCATENATE(FILIACION_ESTUDIANTE!B40,\"  \",FILIACION_ESTUDIANTE!C40,\"  \",FILIACION_ESTUDIANTE!D40)","v":"    "},null,null,null,null,null,null,null,null,null,null,null,null,null,null,null,null,null,null,null,null,null,null,null,null,null,null,0,0,0,0,0]
[34,{"$f":"CONCATENATE(FILIACION_ESTUDIANTE!B41,\"  \",FILIACION_ESTUDIANTE!C41,\"  \",FILIACION_ESTUDIANTE!D41)","v":"    "},null,null,null,null,null,null,null,null,null,null,null,null,null,null,null,null,null,null,null,null,null,null,null,null,null,null,0,0,0,0,0]
[35,{"$f":"CONCATENATE(FILIACION_ESTUDIANTE!B42,\"  \",FILIACION_ESTUDIANTE!C42,\"  \",FILIACION_ESTUDIANTE!D42)","v":"    "},null,null,null,null,null,null,null,null,null,null,null,null,null,null,null,null,null,null,null,null,null,null,null,null,null,null,0,0,0,0,0]
[36,{"$f":"CONCATENATE(FILIACION_ESTUDIANTE!B43,\"  \",FILIACION_ESTUDIANTE!C43,\"  \",FILIACION_ESTUDIANTE!D43)","v":"    "},null,null,null,null,null,null,null,null,null,null,null,null,null,null,null,null,null,null,null,null,null,null,null,null,null,null,0,0,0,0,0]
[37,{"$f":"CONCATENATE(FILIACION_ESTUDIANTE!B44,\"  \",FILIACION_ESTUDIANTE!C44,\"  \",FILIACION_ESTUDIANTE!D44)","v":"    "},null,null,null,null,null,null,null,null,null,null,null,null,null,null,null,null,null,null,null,null,null,null,null,null,null,null,0,0,0,0,0]
[38,{"$f":"CONCATENATE(FILIACION_ESTUDIANTE!B45,\"  \",FILIACION_ESTUDIANTE!C45,\"  \",FILIACION_ESTUDIANTE!D45)","v":"    "},null,null,null,null,null,null,null,null,null,null,null,null,null,null,null,null,null,null,null,null,null,null,null,null,null,null,0,0,0,0,0]
[39,{"$f":"CONCATENATE(FILIACION_ESTUDIANTE!B46,\"  \",FILIACION_ESTUDIANTE!C46,\"  \",FILIACION_ESTUDIANTE!D46)","v":"    "},null,null,null,null,null,null,null,null,null,null,null,null,null,null,null,null,null,null,null,null,null,null,null,null,null,null,0,0,0,0,0]
[40,{"$f":"CONCATENATE(FILIACION_ESTUDIANTE!B47,\"  \",FILIACION_ESTUDIANTE!C47,\"  \",FILIACION_ESTUDIANTE!D47)","v":"    "},null,null,null,null,null,null,null,null,null,null,null,null,null,null,null,null,null,null,null,null,null,null,null,null,null,null,0,0,0,0,0]
[null,null,null,null,null,null,null,null,null,null,null,null,null,null,null,null,null,null,null,null,null,null,null,null,"TOTAL",null,null,null,{"$f":"SUM(AC9:AC48)","v":0},{"$f":"SUM(AD9:AD48)","v":0},{"$f":"SUM(AE9:AF48)","v":0},null,{"$f":"SUM(AG9:AG48)","v":0},{"$f":"IF(AJ50=0,\"Asistencia Vacia contactese con eliascarloshidalgo@gmail.com O LLAME AL 74094003\",IF(#REF!=#REF!,\"Impresión Asistencia  correcta \",\"CUIDADO LOS RESULTADOS NO SON LOS CORRECTOS\"))","v":{"$error":"#REF!"}}]
[null,null,null,null,null,null,null,null,null,null,null,null,null,null,null,null,null,null,null,null,null,null,null,null,null,null,null,null,null,null,null,null,null,null,null,{"$f":"(SUM(AF9:AF48,AC9:AD48)/#REF!)","v":{"$error":"#REF!"}},"SUMATORIA","DIAS TRAB","PROMEDIO"]
[null,null,null,null,null,null,null,null,null,null,null,null,null,null,null,null,null,null,null,null,null,null,null,null,null,null,null,"%"]
[null,null,null,null,null,null,null,null,null,null,null,null,null,null,null,null,null,null,null,null,null,null,"LICENCIA",null,null,null,null,{"$f":"IFERROR(AC49/AG49,\"\")","v":""}]
[null,null,null,null,null,null,null,null,null,null,null,null,null,null,null,null,null,null,null,null,null,null,"FALTA",null,null,null,null,{"$f":"IFERROR(AD49/AG49,\"\")","v":""}]
[null,null,null,null,null,null,null,null,null,null,null,null,null,null,null,null,null,null,null,null,null,null,"PRESENTE",null,null,null,null,{"$f":"IFERROR(AE49/AG49,\"\")","v":""}]
[null,null,null,null,null,null,null,null,null,null,null,null,null,null,null,null,null,null,null,null,null,null,"TOTAL %",null,null,null,null,{"$f":"SUM(AB52:AD54)","v":0}]

{"sheet":"JUNIO","index":13,"n_rows":55,"n_cols":53,"rows_kept":55,"cut":false,"hidden":false,"merged":[[45,1,45,4],[46,1,46,4],[40,1,40,4],[41,1,41,4],[42,1,42,4],[43,1,43,4],[44,1,44,4],[26,37,26,39],[35,1,35,4],[27,1,27,4],[27,37,27,39],[28,1,28,4],[28,37,28,39],[29,1,29,4],[29,37,29,39],[30,1,30,4],[31,1,31,4],[32,1,32,4],[33,1,33,4],[34,1,34,4],[26,1,26,4],[23,37,23,39],[24,1,24,4],[24,37,24,39],[25,1,25,4],[25,37,25,39],[23,1,23,4],[21,37,21,39],[22,1,22,4],[22,37,22,39],[20,1,20,4],[20,37,20,39],[21,1,21,4],[16,37,18,39],[17,1,17,4],[18,1,18,4],[19,1,19,4],[6,31,7,31],[8,1,8,4],[8,33,47,33],[9,1,9,4],[10,1,10,4],[11,1,11,4],[12,1,12,4],[13,1,13,4],[14,1,14,4],[15,1,15,4],[16,1,16,4],[19,37,19,39],[0,33,0,34],[1,0,1,31],[2,0,2,31],[3,0,3,2],[3,3,3,12],[3,24,3,27],[3,28,3,31],[0,0,0,31],[5,0,5,31],[4,0,4,2],[4,3,4,33],[48,24,48,27],[48,30,48,31],[6,0,7,0],[6,1,7,3],[6,28,7,28],[6,29,7,29],[6,30,7,30],[6,32,7,32],[47,1,47,4],[36,1,36,4],[37,1,37,4],[38,1,38,4],[39,1,39,4],[53,22,53,26],[53,27,53,29],[54,22,54,26],[54,27,54,29],[50,22,50,26],[50,27,50,29],[51,22,51,26],[51,27,51,29],[52,22,52,26],[52,27,52,29]]}
[null,null,null,null,null,null,null,null,null,null,null,null,null,null,null,null,null,null,null,null,null,null,null,null,null,null,null,null,null,null,null,null,null,"ASISTENCIAS E INASISTENCIAS",null,"AZUL"]
[null,null,null,null,null,null,null,null,null,null,null,null,null,null,null,null,null,null,null,null,null,null,null,null,null,null,null,null,null,null,null,null,null,"Presente","P"]
[{"$f":"AL24","v":"REGISTRO DE ASISTENCIA JUNIO  2019"},null,null,null,null,null,null,null,null,null,null,null,null,null,null,null,null,null,null,null,null,null,null,null,null,null,null,null,null,null,null,null,null,"Atraso","A"]
[{"$f":"+UPPER(CARATULA!C20)","v":"MAESTRA (O):"},null,null,{"$f":"CARATULA!E20","v":0},null,null,null,null,null,null,null,null,null,null,null,null,null,null,null,null,null,null,null,null,"TURNO: ",null,null,null,{"$f":"CARATULA!E13","v":0},null,null,null,null,"falta con licencia","F"]
["PARALELO:",null,null,{"$f":"CARATULA!E14","v":0},null,null,null,null,null,null,null,null,null,null,null,null,null,null,null,null,null,null,null,null,null,null,null,null,null,null,null,null,null,null,"L"]
[{"$f":"+CONCATENATE(\"AÑO DE ESCOLARIDAD:  \",CARATULA!E21)","v":"AÑO DE ESCOLARIDAD:  "}]
["Nº","NÓMINA",null,null,"DÍA","L","M","M","J","V","L","M","M","J","L","L","M","M","J","V","L",{"$f":"IF(F8=7,\"\",\"M\")","v":"M"},{"$f":"IF(V8>27,\"\",\"M\")","v":"M"},{"$f":"IF(W8>27,\"\",\"J\")","v":"J"},{"$f":"IF(X8>27,\"\",\"V\")","v":"V"},null,null,null,"LICENCIA (L)","FALTA (F)","ATRASO (A)","PRESENTE (P)","DÍAS TRABAJADOS","dias materias tecnicas",0]
[null,null,null,null,"FECHA",3,{"$f":"F8+1","v":4},{"$f":"G8+1","v":5},{"$f":"H8+1","v":6},{"$f":"I8+1","v":7},{"$f":"J8+3","v":10},{"$f":"K8+1","v":11},{"$f":"L8+1","v":12},{"$f":"M8+1","v":13},{"$f":"N8+1","v":14},{"$f":"O8+3","v":17},{"$f":"P8+1","v":18},{"$f":"Q8+1","v":19},{"$f":"R8+1","v":20},{"$f":"S8+1","v":21},{"$f":"T8+3","v":24},{"$f":"IF(F8=7,\"\",U8+1)","v":25},{"$f":"IF(V8>27,\"\",V8+1)","v":26},{"$f":"IF(W8>27,\"\",W8+1)","v":27},{"$f":"IF(X8>27,\"\",X8+1)","v":28}]
[1,{"$f":"CONCATENATE(FILIACION_ESTUDIANTE!B8,\"  \",FILIACION_ESTUDIANTE!C8,\"  \",FILIACION_ESTUDIANTE!D8)","v":"    "},null,null,null,null,null,null,null,null,null,null,null,null,null,null,null,null,null,null,null,null,null,null,null,null,null,null,{"$f":"COUNTIF((F9:AB9),\"L\")","v":0},{"$f":"COUNTIF((F9:AB9),\"F\")","v":0},{"$f":"COUNTIF((F9:AB9),\"A\")","v":0},{"$f":"COUNTIF((F9:AB9),\"P\")","v":0},{"$f":"ROUND(SUM(AC9:AF9),)","v":0},"JUNIO"]
[2,{"$f":"CONCATENATE(FILIACION_ESTUDIANTE!B9,\"  \",FILIACION_ESTUDIANTE!C9,\"  \",FILIACION_ESTUDIANTE!D9)","v":"    "},null,null,null,null,null,null,null,null,null,null,null,null,null,null,null,null,null,null,null,null,null,null,null,null,null,null,{"$f":"COUNTIF((F10:AB10),\"L\")","v":0},{"$f":"COUNTIF((F10:AB10),\"F\")","v":0},{"$f":"COUNTIF((F10:AB10),\"A\")","v":0},{"$f":"COUNTIF((F10:AB10),\"P\")","v":0},0]
[3,{"$f":"CONCATENATE(FILIACION_ESTUDIANTE!B10,\"  \",FILIACION_ESTUDIANTE!C10,\"  \",FILIACION_ESTUDIANTE!D10)","v":"    "},null,null,null,null,null,null,null,null,null,null,null,null,null,null,null,null,null,null,null,null,null,null,null,null,null,null,0,0,0,0,0]
[4,{"$f":"CONCATENATE(FILIACION_ESTUDIANTE!B11,\"  \",FILIACION_ESTUDIANTE!C11,\"  \",FILIACION_ESTUDIANTE!D11)","v":"    "},null,null,null,null,null,null,null,null,null,null,null,null,null,null,null,null,null,null,null,null,null,null,null,null,null,null,0,0,0,0,0,null,null,null,null,null,null,null,null,null,null,null,null,null,null,null,null,null,null,{"$f":"ISLOGICAL((#REF!))","v":false},1]
[5,{"$f":"CONCATENATE(FILIACION_ESTUDIANTE!B12,\"  \",FILIACION_ESTUDIANTE!C12,\"  \",FILIACION_ESTUDIANTE!D12)","v":"    "},null,null,null,null,null,null,null,null,null,null,null,null,null,null,null,null,null,null,null,null,null,null,null,null,null,null,0,0,0,0,0,null,null,null,null,null,null,null,null,null,null,null,null,null,null,null,null,null,null,null,"A"]
[6,{"$f":"CONCATENATE(FILIACION_ESTUDIANTE!B13,\"  \",FILIACION_ESTUDIANTE!C13,\"  \",FILIACION_ESTUDIANTE!D13)","v":"    "},null,null,null,null,null,null,null,null,null,null,null,null,null,null,null,null,null,null,null,null,null,null,null,null,null,null,0,0,0,0,0,null,null,null,null,null,null,null,null,null,null,null,null,null,null,null,null,null,{"$f":"ISTEXT(#REF!)","v":false}]
[7,{"$f":"CONCATENATE(FILIACION_ESTUDIANTE!B14,\"  \",FILIACION_ESTUDIANTE!C14,\"  \",FILIACION_ESTUDIANTE!D14)","v":"    "},null,null,null,null,null,null,null,null,null,null,null,null,null,null,null,null,null,null,null,null,null,null,null,null,null,null,0,0,0,0,0,null,null,null,null,null,null,null,null,null,null,null,null,null,null,null,null,null,null,null,"a"]
[8,{"$f":"CONCATENATE(FILIACION_ESTUDIANTE!B15,\"  \",FILIACION_ESTUDIANTE!C15,\"  \",FILIACION_ESTUDIANTE!D15)","v":"    "},null,null,null,null,null,null,null,null,null,null,null,null,null,null,null,null,null,null,null,null,null,null,null,null,null,null,0,0,0,0,0,null,null,null,null,null,null,null,null,null,null,null,null,null,null,null,null,null,null,null,"a"]
[9,{"$f":"CONCATENATE(FILIACION_ESTUDIANTE!B16,\"  \",FILIACION_ESTUDIANTE!C16,\"  \",FILIACION_ESTUDIANTE!D16)","v":"    "},null,null,null,null,null,null,null,null,null,null,null,null,null,null,null,null,null,null,null,null,null,null,null,null,null,null,0,0,0,0,0,null,null,null,null,"ENCABEZADO DE LOS FORMULARIOS DE CONTROL DE ASISTENCIA",null,null,null,null,null,null,null,null,null,null,null,{"$f":"MONTH(AX18)","v":2},null,null,"f"]
[10,{"$f":"CONCATENATE(FILIACION_ESTUDIANTE!B17,\"  \",FILIACION_ESTUDIANTE!C17,\"  \",FILIACION_ESTUDIANTE!D17)","v":"    "},null,null,null,null,null,null,null,null,null,null,null,null,null,null,null,null,null,null,null,null,null,null,null,null,null,null,0,0,0,0,0,null,null,null,null,null,null,null,null,null,null,null,null,null,null,null,null,"2010-02-01",null,null,"f"]
[11,{"$f":"CONCATENATE(FILIACION_ESTUDIANTE!B18,\"  \",FILIACION_ESTUDIANTE!C18,\"  \",FILIACION_ESTUDIANTE!D18)","v":"    "},null,null,null,null,null,null,null,null,null,null,null,null,null,null,null,null,null,null,null,null,null,null,null,null,null,null,0,0,0,0,0,null,null,null,null,null,null,null,null,null,null,null,null,null,null,null,null,null,null,null,"f"]
[12,{"$f":"CONCATENATE(FILIACION_ESTUDIANTE!B19,\"  \",FILIACION_ESTUDIANTE!C19,\"  \",FILIACION_ESTUDIANTE!D19)","v":"    "},null,null,null,null,null,null,null,null,null,null,null,null,null,null,null,null,null,null,null,null,null,null,null,null,null,null,0,0,0,0,0,null,null,null,null,{"$f":"CONCATENATE(AO20,\" \",AP20)","v":"REGISTRO DE ASISTENCIA FEBRERO  2019"},null,null,"REGISTRO DE ASISTENCIA FEBRERO ",{"$f":"CARATULA!F26","v":2019},null,null,null,null,null,null,null,null,null,null,"p"]
[13,{"$f":"CONCATENATE(FILIACION_ESTUDIANTE!B20,\"  \",FILIACION_ESTUDIANTE!C20,\"  \",FILIACION_ESTUDIANTE!D20)","v":"    "},null,null,null,null,null,null,null,null,null,null,null,null,null,null,null,null,null,null,null,null,null,null,null,null,null,null,0,0,0,0,0,null,null,null,null,{"$f":"CONCATENATE(AO21,\" \",AP21)","v":"REGISTRO DE ASISTENCIA MARZO  2019"},null,null,"REGISTRO DE ASISTENCIA MARZO ",{"$f":"AP20","v":2019},null,null,null,null,null,null,null,null,null,null,"y"]
[14,{"$f":"CONCATENATE(FILIACION_ESTUDIANTE!B21,\"  \",FILIACION_ESTUDIANTE!C21,\"  \",FILIACION_ESTUDIANTE!D21)","v":"    "},null,null,null,null,null,null,null,null,null,null,null,null,null,null,null,null,null,null,null,null,null,null,null,null,null,null,0,0,0,0,0,null,null,null,null,"REGISTRO DE ASISTENCIA ABRIL  2019",null,null,"REGISTRO DE ASISTENCIA ABRIL ",{"$f":"AP21","v":2019},null,null,null,null,null,null,null,null,null,null,"a"]
[15,{"$f":"CONCATENATE(FILIACION_ESTUDIANTE!B22,\"  \",FILIACION_ESTUDIANTE!C22,\"  \",FILIACION_ESTUDIANTE!D22)","v":"    "},null,null,null,null,null,null,null,null,null,null,null,null,null,null,null,null,null,null,null,null,null,null,null,null,null,null,0,0,0,0,0,null,null,null,null,"REGISTRO DE ASISTENCIA MAYO  2019",null,null,"REGISTRO DE ASISTENCIA MAYO ",{"$f":"AP22","v":2019},null,null,null,null,null,null,null,null,null,null,"a"]
[16,{"$f":"CONCATENATE(FILIACION_ESTUDIANTE!B23,\"  \",FILIACION_ESTUDIANTE!C23,\"  \",FILIACION_ESTUDIANTE!D23)","v":"    "},null,null,null,null,null,null,null,null,null,null,null,null,null,null,null,null,null,null,null,null,null,null,null,null,null,null,0,0,0,0,0,null,null,null,null,"REGISTRO DE ASISTENCIA JUNIO  2019",null,null,"REGISTRO DE ASISTENCIA JUNIO ",2019,null,null,null,null,null,null,null,null,null,null,"a"]
[17,{"$f":"CONCATENATE(FILIACION_ESTUDIANTE!B24,\"  \",FILIACION_ESTUDIANTE!C24,\"  \",FILIACION_ESTUDIANTE!D24)","v":"    "},null,null,null,null,null,null,null,null,null,null,null,null,null,null,null,null,null,null,null,null,null,null,null,null,null,null,0,0,0,0,0,null,null,null,null,"REGISTRO DE ASISTENCIA JULIO  2019",null,null,"REGISTRO DE ASISTENCIA JULIO ",2019,null,null,null,null,null,null,null,null,null,null,"a"]
[18,{"$f":"CONCATENATE(FILIACION_ESTUDIANTE!B25,\"  \",FILIACION_ESTUDIANTE!C25,\"  \",FILIACION_ESTUDIANTE!D25)","v":"    "},null,null,null,null,null,null,null,null,null,null,null,null,null,null,null,null,null,null,null,null,null,null,null,null,null,null,0,0,0,0,0,null,null,null,null,"REGISTRO DE ASISTENCIA AGOSTO  2019",null,null,"REGISTRO DE ASISTENCIA AGOSTO ",2019,null,null,null,null,null,null,null,null,null,null,"a"]
[19,{"$f":"CONCATENATE(FILIACION_ESTUDIANTE!B26,\"  \",FILIACION_ESTUDIANTE!C26,\"  \",FILIACION_ESTUDIANTE!D26)","v":"    "},null,null,null,null,null,null,null,null,null,null,null,null,null,null,null,null,null,null,null,null,null,null,null,null,null,null,0,0,0,0,0,null,null,null,null,"REGISTRO DE ASISTENCIA SEPTIEMBRE  2019",null,null,"REGISTRO DE ASISTENCIA SEPTIEMBRE ",2019,null,null,null,null,null,null,null,null,null,null,"a"]
[20,{"$f":"CONCATENATE(FILIACION_ESTUDIANTE!B27,\"  \",FILIACION_ESTUDIANTE!C27,\"  \",FILIACION_ESTUDIANTE!D27)","v":"    "},null,null,null,null,null,null,null,null,null,null,null,null,null,null,null,null,null,null,null,null,null,null,null,null,null,null,0,0,0,0,0,null,null,null,null,"REGISTRO DE ASISTENCIA OCTUBRE  2019",null,null,"REGISTRO DE ASISTENCIA OCTUBRE ",2019,null,null,null,null,null,null,null,null,null,null,"f"]
[21,{"$f":"CONCATENATE(FILIACION_ESTUDIANTE!B28,\"  \",FILIACION_ESTUDIANTE!C28,\"  \",FILIACION_ESTUDIANTE!D28)","v":"    "},null,null,null,null,null,null,null,null,null,null,null,null,null,null,null,null,null,null,null,null,null,null,null,null,null,null,0,0,0,0,0,null,null,null,null,"REGISTRO DE ASISTENCIA NOVIEMBRE  2019",null,null,"REGISTRO DE ASISTENCIA NOVIEMBRE ",2019,null,null,null,null,null,null,null,null,null,null,"p"]
[22,{"$f":"CONCATENATE(FILIACION_ESTUDIANTE!B29,\"  \",FILIACION_ESTUDIANTE!C29,\"  \",FILIACION_ESTUDIANTE!D29)","v":"    "},null,null,null,null,null,null,null,null,null,null,null,null,null,null,null,null,null,null,null,null,null,null,null,null,null,null,0,0,0,0,0,null,null,null,null,"REGISTRO DE ASISTENCIA DICIEMBRE  2019",null,null,"REGISTRO DE ASISTENCIA DICIEMBRE ",2019,null,null,null,null,null,null,null,null,null,null,"M"]
[23,{"$f":"CONCATENATE(FILIACION_ESTUDIANTE!B30,\"  \",FILIACION_ESTUDIANTE!C30,\"  \",FILIACION_ESTUDIANTE!D30)","v":"    "},null,null,null,null,null,null,null,null,null,null,null,null,null,null,null,null,null,null,null,null,null,null,null,null,null,null,0,0,0,0,0]
[24,{"$f":"CONCATENATE(FILIACION_ESTUDIANTE!B31,\"  \",FILIACION_ESTUDIANTE!C31,\"  \",FILIACION_ESTUDIANTE!D31)","v":"    "},null,null,null,null,null,null,null,null,null,null,null,null,null,null,null,null,null,null,null,null,null,null,null,null,null,null,0,0,0,0,0,null,null,null,null,null,null,null,null,null,null,null,null,null,null,null,null,null,null,null,"M"]
[25,{"$f":"CONCATENATE(FILIACION_ESTUDIANTE!B32,\"  \",FILIACION_ESTUDIANTE!C32,\"  \",FILIACION_ESTUDIANTE!D32)","v":"    "},null,null,null,null,null,null,null,null,null,null,null,null,null,null,null,null,null,null,null,null,null,null,null,null,null,null,0,0,0,0,0,null,null,null,null,null,null,null,null,null,null,null,null,null,null,null,null,null,null,null,"M"]
[26,{"$f":"CONCATENATE(FILIACION_ESTUDIANTE!B33,\"  \",FILIACION_ESTUDIANTE!C33,\"  \",FILIACION_ESTUDIANTE!D33)","v":"    "},null,null,null,null,null,null,null,null,null,null,null,null,null,null,null,null,null,null,null,null,null,null,null,null,null,null,0,0,0,0,0,null,null,null,null,null,null,null,null,null,null,null,null,null,null,null,null,null,null,null,"M"]
[27,{"$f":"CONCATENATE(FILIACION_ESTUDIANTE!B34,\"  \",FILIACION_ESTUDIANTE!C34,\"  \",FILIACION_ESTUDIANTE!D34)","v":"    "},null,null,null,null,null,null,null,null,null,null,null,null,null,null,null,null,null,null,null,null,null,null,null,null,null,null,0,0,0,0,0,null,null,null,null,null,null,null,null,null,null,null,null,null,null,null,null,null,null,null,"M"]
[28,{"$f":"CONCATENATE(FILIACION_ESTUDIANTE!B35,\"  \",FILIACION_ESTUDIANTE!C35,\"  \",FILIACION_ESTUDIANTE!D35)","v":"    "},null,null,null,null,null,null,null,null,null,null,null,null,null,null,null,null,null,null,null,null,null,null,null,null,null,null,0,0,0,0,0,null,null,null,null,null,null,null,null,null,null,null,null,null,null,null,null,null,null,null,"M"]
[29,{"$f":"CONCATENATE(FILIACION_ESTUDIANTE!B36,\"  \",FILIACION_ESTUDIANTE!C36,\"  \",FILIACION_ESTUDIANTE!D36)","v":"    "},null,null,null,null,null,null,null,null,null,null,null,null,null,null,null,null,null,null,null,null,null,null,null,null,null,null,0,0,0,0,0]
[30,{"$f":"CONCATENATE(FILIACION_ESTUDIANTE!B37,\"  \",FILIACION_ESTUDIANTE!C37,\"  \",FILIACION_ESTUDIANTE!D37)","v":"    "},null,null,null,null,null,null,null,null,null,null,null,null,null,null,null,null,null,null,null,null,null,null,null,null,null,null,0,0,0,0,0]
[31,{"$f":"CONCATENATE(FILIACION_ESTUDIANTE!B38,\"  \",FILIACION_ESTUDIANTE!C38,\"  \",FILIACION_ESTUDIANTE!D38)","v":"    "},null,null,null,null,null,null,null,null,null,null,null,null,null,null,null,null,null,null,null,null,null,null,null,null,null,null,0,0,0,0,0,null,null,null,null,null,null,null,null,null,null,null,null,null,null,null,null,null,null,null,"M"]
[32,{"$f":"CONCATENATE(FILIACION_ESTUDIANTE!B39,\"  \",FILIACION_ESTUDIANTE!C39,\"  \",FILIACION_ESTUDIANTE!D39)","v":"    "},null,null,null,null,null,null,null,null,null,null,null,null,null,null,null,null,null,null,null,null,null,null,null,null,null,null,0,0,0,0,0,null,null,null,null,null,null,null,null,null,null,null,null,null,null,null,null,null,null,null,"M"]
[33,{"$f":"CONCATENATE(FILIACION_ESTUDIANTE!B40,\"  \",FILIACION_ESTUDIANTE!C40,\"  \",FILIACION_ESTUDIANTE!D40)","v":"    "},null,null,null,null,null,null,null,null,null,null,null,null,null,null,null,null,null,null,null,null,null,null,null,null,null,null,0,0,0,0,0]
[34,{"$f":"CONCATENATE(FILIACION_ESTUDIANTE!B41,\"  \",FILIACION_ESTUDIANTE!C41,\"  \",FILIACION_ESTUDIANTE!D41)","v":"    "},null,null,null,null,null,null,null,null,null,null,null,null,null,null,null,null,null,null,null,null,null,null,null,null,null,null,0,0,0,0,0]
[35,{"$f":"CONCATENATE(FILIACION_ESTUDIANTE!B42,\"  \",FILIACION_ESTUDIANTE!C42,\"  \",FILIACION_ESTUDIANTE!D42)","v":"    "},null,null,null,null,null,null,null,null,null,null,null,null,null,null,null,null,null,null,null,null,null,null,null,null,null,null,0,0,0,0,0]
[36,{"$f":"CONCATENATE(FILIACION_ESTUDIANTE!B43,\"  \",FILIACION_ESTUDIANTE!C43,\"  \",FILIACION_ESTUDIANTE!D43)","v":"    "},null,null,null,null,null,null,null,null,null,null,null,null,null,null,null,null,null,null,null,null,null,null,null,null,null,null,0,0,0,0,0]
[37,{"$f":"CONCATENATE(FILIACION_ESTUDIANTE!B44,\"  \",FILIACION_ESTUDIANTE!C44,\"  \",FILIACION_ESTUDIANTE!D44)","v":"    "},null,null,null,null,null,null,null,null,null,null,null,null,null,null,null,null,null,null,null,null,null,null,null,null,null,null,0,0,0,0,0]
[38,{"$f":"CONCATENATE(FILIACION_ESTUDIANTE!B45,\"  \",FILIACION_ESTUDIANTE!C45,\"  \",FILIACION_ESTUDIANTE!D45)","v":"    "},null,null,null,null,null,null,null,null,null,null,null,null,null,null,null,null,null,null,null,null,null,null,null,null,null,null,0,0,0,0,0]
[39,{"$f":"CONCATENATE(FILIACION_ESTUDIANTE!B46,\"  \",FILIACION_ESTUDIANTE!C46,\"  \",FILIACION_ESTUDIANTE!D46)","v":"    "},null,null,null,null,null,null,null,null,null,null,null,null,null,null,null,null,null,null,null,null,null,null,null,null,null,null,0,0,0,0,0]
[40,{"$f":"CONCATENATE(FILIACION_ESTUDIANTE!B47,\"  \",FILIACION_ESTUDIANTE!C47,\"  \",FILIACION_ESTUDIANTE!D47)","v":"    "},null,null,null,null,null,null,null,null,null,null,null,null,null,null,null,null,null,null,null,null,null,null,null,null,null,null,0,0,0,0,0]
[null,null,null,null,null,null,null,null,null,null,null,null,null,null,null,null,null,null,null,null,null,null,null,null,"TOTAL",null,null,null,{"$f":"SUM(AC9:AC48)","v":0},{"$f":"SUM(AD9:AD48)","v":0},{"$f":"SUM(AE9:AF48)","v":0},null,{"$f":"SUM(AG9:AG48)","v":0}]
[]
[null,null,null,null,null,null,null,null,null,null,null,null,null,null,null,null,null,null,null,null,null,null,null,null,null,null,null,"%"]
[null,null,null,null,null,null,null,null,null,null,null,null,null,null,null,null,null,null,null,null,null,null,"LICENCIA",null,null,null,null,{"$f":"IFERROR(AC49/AG49,\"\")","v":""}]
[null,null,null,null,null,null,null,null,null,null,null,null,null,null,null,null,null,null,null,null,null,null,"FALTA",null,null,null,null,{"$f":"IFERROR(AD49/AG49,\"\")","v":""}]
[null,null,null,null,null,null,null,null,null,null,null,null,null,null,null,null,null,null,null,null,null,null,"PRESENTE",null,null,null,null,{"$f":"IFERROR(AE49/AG49,\"\")","v":""}]
[null,null,null,null,null,null,null,null,null,null,null,null,null,null,null,null,null,null,null,null,null,null,"TOTAL %",null,null,null,null,{"$f":"SUM(AB52:AD54)","v":0}]

{"sheet":"JULIO","index":14,"n_rows":55,"n_cols":53,"rows_kept":55,"cut":false,"hidden":false,"merged":[[44,1,44,4],[45,1,45,4],[46,1,46,4],[39,1,39,4],[40,1,40,4],[41,1,41,4],[42,1,42,4],[43,1,43,4],[26,37,26,39],[35,1,35,4],[27,1,27,4],[27,37,27,39],[28,1,28,4],[28,37,28,39],[29,1,29,4],[29,37,29,39],[30,1,30,4],[31,1,31,4],[32,1,32,4],[33,1,33,4],[34,1,34,4],[26,1,26,4],[23,37,23,39],[24,1,24,4],[24,37,24,39],[25,1,25,4],[25,37,25,39],[23,1,23,4],[21,37,21,39],[22,1,22,4],[22,37,22,39],[20,1,20,4],[20,37,20,39],[21,1,21,4],[16,37,18,39],[17,1,17,4],[18,1,18,4],[19,1,19,4],[6,31,7,31],[8,1,8,4],[8,33,47,33],[9,1,9,4],[10,1,10,4],[11,1,11,4],[12,1,12,4],[13,1,13,4],[14,1,14,4],[15,1,15,4],[16,1,16,4],[19,37,19,39],[0,33,0,34],[1,0,1,31],[2,0,2,31],[3,0,3,2],[3,3,3,12],[3,24,3,27],[3,28,3,31],[0,0,0,31],[5,0,5,31],[4,3,4,32],[48,24,48,27],[48,30,48,31],[50,22,50,26],[50,27,50,29],[6,0,7,0],[6,1,7,3],[6,28,7,28],[6,29,7,29],[6,30,7,30],[6,32,7,32],[47,1,47,4],[36,1,36,4],[37,1,37,4],[38,1,38,4],[54,22,54,26],[54,27,54,29],[51,22,51,26],[51,27,51,29],[52,22,52,26],[52,27,52,29],[53,22,53,26],[53,27,53,29]]}
[null,null,null,null,null,null,null,null,null,null,null,null,null,null,null,null,null,null,null,null,null,null,null,null,null,null,null,null,null,null,null,null,null,"ASISTENCIAS E INASISTENCIAS",null,"AZUL"]
[null,null,null,null,null,null,null,null,null,null,null,null,null,null,null,null,null,null,null,null,null,null,null,null,null,null,null,null,null,null,null,null,null,"Presente","P"]
[{"$f":"AL25","v":"REGISTRO DE ASISTENCIA JULIO  2019"},null,null,null,null,null,null,null,null,null,null,null,null,null,null,null,null,null,null,null,null,null,null,null,null,null,null,null,null,null,null,null,null,"Atraso","A"]
[{"$f":"+UPPER(CARATULA!C20)","v":"MAESTRA (O):"},null,null,{"$f":"CARATULA!E20","v":0},null,null,null,null,null,null,null,null,null,null,null,null,null,null,null,null,null,null,null,null,"TURNO: ",null,null,null,{"$f":"CARATULA!E13","v":0},null,null,null,null,"falta con licencia","F"]
["PARALELO:",null,null,{"$f":"CARATULA!E14","v":0},null,null,null,null,null,null,null,null,null,null,null,null,null,null,null,null,null,null,null,null,null,null,null,null,null,null,null,null,null,"Falta sin licencia","L"]
[{"$f":"+CONCATENATE(\"AÑO DE ESCOLARIDAD:  \",CARATULA!E21)","v":"AÑO DE ESCOLARIDAD:  "}]
["Nº","NÓMINA",null,null,"DÍA","L","M","M","J","V","L","M","M","J","V","L","M","M","J","V","L",{"$f":"IF(F8=7,\"\",\"M\")","v":"M"},{"$f":"IF(V8>27,\"\",\"M\")","v":"M"},{"$f":"IF(W8>27,\"\",\"J\")","v":"J"},{"$f":"IF(X8>27,\"\",\"V\")","v":"V"},"L",{"$f":"IF(K8=7,\"\",\"M\")","v":"M"},{"$f":"IF(L8=7,\"\",\"M\")","v":"M"},"LICENCIA (L)","FALTA (F)","ATRASO (A)","PRESENTE (P)","DÍAS TRABAJADOS","dias materias tecnicas",0]
[null,null,null,null,"FECHA",1,{"$f":"F8+1","v":2},{"$f":"G8+1","v":3},{"$f":"H8+1","v":4},{"$f":"I8+1","v":5},{"$f":"J8+3","v":8},{"$f":"K8+1","v":9},{"$f":"L8+1","v":10},{"$f":"M8+1","v":11},{"$f":"N8+1","v":12},{"$f":"O8+3","v":15},{"$f":"P8+1","v":16},{"$f":"Q8+1","v":17},{"$f":"R8+1","v":18},{"$f":"S8+1","v":19},{"$f":"T8+3","v":22},{"$f":"U8+1","v":23},24,25,26,{"$f":"Y8+3","v":29},30,31]
[1,{"$f":"CONCATENATE(FILIACION_ESTUDIANTE!B8,\"  \",FILIACION_ESTUDIANTE!C8,\"  \",FILIACION_ESTUDIANTE!D8)","v":"    "},null,null,null,null,null,null,null,null,null,null,null,null,null,null,null,null,null,null,null,null,null,null,null,null,null,null,{"$f":"COUNTIF((F9:AB9),\"L\")","v":0},{"$f":"COUNTIF((F9:AB9),\"F\")","v":0},{"$f":"COUNTIF((F9:AB9),\"A\")","v":0},{"$f":"COUNTIF((F9:AB9),\"P\")","v":0},{"$f":"ROUND(SUM(AC9:AF9),)","v":0},"JULIO"]
[2,{"$f":"CONCATENATE(FILIACION_ESTUDIANTE!B9,\"  \",FILIACION_ESTUDIANTE!C9,\"  \",FILIACION_ESTUDIANTE!D9)","v":"    "},null,null,null,null,null,null,null,null,null,null,null,null,null,null,null,null,null,null,null,null,null,null,null,null,null,null,{"$f":"COUNTIF((F10:AB10),\"L\")","v":0},{"$f":"COUNTIF((F10:AB10),\"F\")","v":0},{"$f":"COUNTIF((F10:AB10),\"A\")","v":0},{"$f":"COUNTIF((F10:AB10),\"P\")","v":0},0]
[3,{"$f":"CONCATENATE(FILIACION_ESTUDIANTE!B10,\"  \",FILIACION_ESTUDIANTE!C10,\"  \",FILIACION_ESTUDIANTE!D10)","v":"    "},null,null,null,null,null,null,null,null,null,null,null,null,null,null,null,null,null,null,null,null,null,null,null,null,null,null,0,0,0,0,0]
[4,{"$f":"CONCATENATE(FILIACION_ESTUDIANTE!B11,\"  \",FILIACION_ESTUDIANTE!C11,\"  \",FILIACION_ESTUDIANTE!D11)","v":"    "},null,null,null,null,null,null,null,null,null,null,null,null,null,null,null,null,null,null,null,null,null,null,null,null,null,null,0,0,0,0,0,null,null,null,null,null,null,null,null,null,null,null,null,null,null,null,null,null,null,{"$f":"ISLOGICAL((#REF!))","v":false},1]
[5,{"$f":"CONCATENATE(FILIACION_ESTUDIANTE!B12,\"  \",FILIACION_ESTUDIANTE!C12,\"  \",FILIACION_ESTUDIANTE!D12)","v":"    "},null,null,null,null,null,null,null,null,null,null,null,null,null,null,null,null,null,null,null,null,null,null,null,null,null,null,0,0,0,0,0,null,null,null,null,null,null,null,null,null,null,null,null,null,null,null,null,null,null,null,"A"]
[6,{"$f":"CONCATENATE(FILIACION_ESTUDIANTE!B13,\"  \",FILIACION_ESTUDIANTE!C13,\"  \",FILIACION_ESTUDIANTE!D13)","v":"    "},null,null,null,null,null,null,null,null,null,null,null,null,null,null,null,null,null,null,null,null,null,null,null,null,null,null,0,0,0,0,0,null,null,null,null,null,null,null,null,null,null,null,null,null,null,null,null,null,{"$f":"ISTEXT(#REF!)","v":false}]
[7,{"$f":"CONCATENATE(FILIACION_ESTUDIANTE!B14,\"  \",FILIACION_ESTUDIANTE!C14,\"  \",FILIACION_ESTUDIANTE!D14)","v":"    "},null,null,null,null,null,null,null,null,null,null,null,null,null,null,null,null,null,null,null,null,null,null,null,null,null,null,0,0,0,0,0,null,null,null,null,null,null,null,null,null,null,null,null,null,null,null,null,null,null,null,"a"]
[8,{"$f":"CONCATENATE(FILIACION_ESTUDIANTE!B15,\"  \",FILIACION_ESTUDIANTE!C15,\"  \",FILIACION_ESTUDIANTE!D15)","v":"    "},null,null,null,null,null,null,null,null,null,null,null,null,null,null,null,null,null,null,null,null,null,null,null,null,null,null,0,0,0,0,0,null,null,null,null,null,null,null,null,null,null,null,null,null,null,null,null,null,null,null,"a"]
[9,{"$f":"CONCATENATE(FILIACION_ESTUDIANTE!B16,\"  \",FILIACION_ESTUDIANTE!C16,\"  \",FILIACION_ESTUDIANTE!D16)","v":"    "},null,null,null,null,null,null,null,null,null,null,null,null,null,null,null,null,null,null,null,null,null,null,null,null,null,null,0,0,0,0,0,null,null,null,null,"ENCABEZADO DE LOS FORMULARIOS DE CONTROL DE ASISTENCIA",null,null,null,null,null,null,null,null,null,null,null,{"$f":"MONTH(AX18)","v":2},null,null,"f"]
[10,{"$f":"CONCATENATE(FILIACION_ESTUDIANTE!B17,\"  \",FILIACION_ESTUDIANTE!C17,\"  \",FILIACION_ESTUDIANTE!D17)","v":"    "},null,null,null,null,null,null,null,null,null,null,null,null,null,null,null,null,null,null,null,null,null,null,null,null,null,null,0,0,0,0,0,null,null,null,null,null,null,null,null,null,null,null,null,null,null,null,null,"2010-02-01",null,null,"f"]
[11,{"$f":"CONCATENATE(FILIACION_ESTUDIANTE!B18,\"  \",FILIACION_ESTUDIANTE!C18,\"  \",FILIACION_ESTUDIANTE!D18)","v":"    "},null,null,null,null,null,null,null,null,null,null,null,null,null,null,null,null,null,null,null,null,null,null,null,null,null,null,0,0,0,0,0,null,null,null,null,null,null,null,null,null,null,null,null,null,null,null,null,null,null,null,"f"]
[12,{"$f":"CONCATENATE(FILIACION_ESTUDIANTE!B19,\"  \",FILIACION_ESTUDIANTE!C19,\"  \",FILIACION_ESTUDIANTE!D19)","v":"    "},null,null,null,null,null,null,null,null,null,null,null,null,null,null,null,null,null,null,null,null,null,null,null,null,null,null,0,0,0,0,0,null,null,null,null,{"$f":"CONCATENATE(AO20,\" \",AP20)","v":"REGISTRO DE ASISTENCIA FEBRERO  2019"},null,null,"REGISTRO DE ASISTENCIA FEBRERO ",{"$f":"CARATULA!F26","v":2019},null,null,null,null,null,null,null,null,null,null,"p"]
[13,{"$f":"CONCATENATE(FILIACION_ESTUDIANTE!B20,\"  \",FILIACION_ESTUDIANTE!C20,\"  \",FILIACION_ESTUDIANTE!D20)","v":"    "},null,null,null,null,null,null,null,null,null,null,null,null,null,null,null,null,null,null,null,null,null,null,null,null,null,null,0,0,0,0,0,null,null,null,null,{"$f":"CONCATENATE(AO21,\" \",AP21)","v":"REGISTRO DE ASISTENCIA MARZO  2019"},null,null,"REGISTRO DE ASISTENCIA MARZO ",{"$f":"AP20","v":2019},null,null,null,null,null,null,null,null,null,null,"y"]
[14,{"$f":"CONCATENATE(FILIACION_ESTUDIANTE!B21,\"  \",FILIACION_ESTUDIANTE!C21,\"  \",FILIACION_ESTUDIANTE!D21)","v":"    "},null,null,null,null,null,null,null,null,null,null,null,null,null,null,null,null,null,null,null,null,null,null,null,null,null,null,0,0,0,0,0,null,null,null,null,"REGISTRO DE ASISTENCIA ABRIL  2019",null,null,"REGISTRO DE ASISTENCIA ABRIL ",{"$f":"AP21","v":2019},null,null,null,null,null,null,null,null,null,null,"a"]
[15,{"$f":"CONCATENATE(FILIACION_ESTUDIANTE!B22,\"  \",FILIACION_ESTUDIANTE!C22,\"  \",FILIACION_ESTUDIANTE!D22)","v":"    "},null,null,null,null,null,null,null,null,null,null,null,null,null,null,null,null,null,null,null,null,null,null,null,null,null,null,0,0,0,0,0,null,null,null,null,"REGISTRO DE ASISTENCIA MAYO  2019",null,null,"REGISTRO DE ASISTENCIA MAYO ",{"$f":"AP22","v":2019},null,null,null,null,null,null,null,null,null,null,"a"]
[16,{"$f":"CONCATENATE(FILIACION_ESTUDIANTE!B23,\"  \",FILIACION_ESTUDIANTE!C23,\"  \",FILIACION_ESTUDIANTE!D23)","v":"    "},null,null,null,null,null,null,null,null,null,null,null,null,null,null,null,null,null,null,null,null,null,null,null,null,null,null,0,0,0,0,0,null,null,null,null,"REGISTRO DE ASISTENCIA JUNIO  2019",null,null,"REGISTRO DE ASISTENCIA JUNIO ",2019,null,null,null,null,null,null,null,null,null,null,"a"]
[17,{"$f":"CONCATENATE(FILIACION_ESTUDIANTE!B24,\"  \",FILIACION_ESTUDIANTE!C24,\"  \",FILIACION_ESTUDIANTE!D24)","v":"    "},null,null,null,null,null,null,null,null,null,null,null,null,null,null,null,null,null,null,null,null,null,null,null,null,null,null,0,0,0,0,0,null,null,null,null,"REGISTRO DE ASISTENCIA JULIO  2019",null,null,"REGISTRO DE ASISTENCIA JULIO ",2019,null,null,null,null,null,null,null,null,null,null,"a"]
[18,{"$f":"CONCATENATE(FILIACION_ESTUDIANTE!B25,\"  \",FILIACION_ESTUDIANTE!C25,\"  \",FILIACION_ESTUDIANTE!D25)","v":"    "},null,null,null,null,null,null,null,null,null,null,null,null,null,null,null,null,null,null,null,null,null,null,null,null,null,null,0,0,0,0,0,null,null,null,null,"REGISTRO DE ASISTENCIA AGOSTO  2019",null,null,"REGISTRO DE ASISTENCIA AGOSTO ",2019,null,null,null,null,null,null,null,null,null,null,"a"]
[19,{"$f":"CONCATENATE(FILIACION_ESTUDIANTE!B26,\"  \",FILIACION_ESTUDIANTE!C26,\"  \",FILIACION_ESTUDIANTE!D26)","v":"    "},null,null,null,null,null,null,null,null,null,null,null,null,null,null,null,null,null,null,null,null,null,null,null,null,null,null,0,0,0,0,0,null,null,null,null,"REGISTRO DE ASISTENCIA SEPTIEMBRE  2019",null,null,"REGISTRO DE ASISTENCIA SEPTIEMBRE ",2019,null,null,null,null,null,null,null,null,null,null,"a"]
[20,{"$f":"CONCATENATE(FILIACION_ESTUDIANTE!B27,\"  \",FILIACION_ESTUDIANTE!C27,\"  \",FILIACION_ESTUDIANTE!D27)","v":"    "},null,null,null,null,null,null,null,null,null,null,null,null,null,null,null,null,null,null,null,null,null,null,null,null,null,null,0,0,0,0,0,null,null,null,null,"REGISTRO DE ASISTENCIA OCTUBRE  2019",null,null,"REGISTRO DE ASISTENCIA OCTUBRE ",2019,null,null,null,null,null,null,null,null,null,null,"f"]
[21,{"$f":"CONCATENATE(FILIACION_ESTUDIANTE!B28,\"  \",FILIACION_ESTUDIANTE!C28,\"  \",FILIACION_ESTUDIANTE!D28)","v":"    "},null,null,null,null,null,null,null,null,null,null,null,null,null,null,null,null,null,null,null,null,null,null,null,null,null,null,0,0,0,0,0,null,null,null,null,"REGISTRO DE ASISTENCIA NOVIEMBRE  2019",null,null,"REGISTRO DE ASISTENCIA NOVIEMBRE ",2019,null,null,null,null,null,null,null,null,null,null,"p"]
[22,{"$f":"CONCATENATE(FILIACION_ESTUDIANTE!B29,\"  \",FILIACION_ESTUDIANTE!C29,\"  \",FILIACION_ESTUDIANTE!D29)","v":"    "},null,null,null,null,null,null,null,null,null,null,null,null,null,null,null,null,null,null,null,null,null,null,null,null,null,null,0,0,0,0,0,null,null,null,null,"REGISTRO DE ASISTENCIA DICIEMBRE  2019",null,null,"REGISTRO DE ASISTENCIA DICIEMBRE ",2019,null,null,null,null,null,null,null,null,null,null,"M"]
[23,{"$f":"CONCATENATE(FILIACION_ESTUDIANTE!B30,\"  \",FILIACION_ESTUDIANTE!C30,\"  \",FILIACION_ESTUDIANTE!D30)","v":"    "},null,null,null,null,null,null,null,null,null,null,null,null,null,null,null,null,null,null,null,null,null,null,null,null,null,null,0,0,0,0,0]
[24,{"$f":"CONCATENATE(FILIACION_ESTUDIANTE!B31,\"  \",FILIACION_ESTUDIANTE!C31,\"  \",FILIACION_ESTUDIANTE!D31)","v":"    "},null,null,null,null,null,null,null,null,null,null,null,null,null,null,null,null,null,null,null,null,null,null,null,null,null,null,0,0,0,0,0,null,null,null,null,null,null,null,null,null,null,null,null,null,null,null,null,null,null,null,"M"]
[25,{"$f":"CONCATENATE(FILIACION_ESTUDIANTE!B32,\"  \",FILIACION_ESTUDIANTE!C32,\"  \",FILIACION_ESTUDIANTE!D32)","v":"    "},null,null,null,null,null,null,null,null,null,null,null,null,null,null,null,null,null,null,null,null,null,null,null,null,null,null,0,0,0,0,0,null,null,null,null,null,null,null,null,null,null,null,null,null,null,null,null,null,null,null,"M"]
[26,{"$f":"CONCATENATE(FILIACION_ESTUDIANTE!B33,\"  \",FILIACION_ESTUDIANTE!C33,\"  \",FILIACION_ESTUDIANTE!D33)","v":"    "},null,null,null,null,null,null,null,null,null,null,null,null,null,null,null,null,null,null,null,null,null,null,null,null,null,null,0,0,0,0,0,null,null,null,null,null,null,null,null,null,null,null,null,null,null,null,null,null,null,null,"M"]
[27,{"$f":"CONCATENATE(FILIACION_ESTUDIANTE!B34,\"  \",FILIACION_ESTUDIANTE!C34,\"  \",FILIACION_ESTUDIANTE!D34)","v":"    "},null,null,null,null,null,null,null,null,null,null,null,null,null,null,null,null,null,null,null,null,null,null,null,null,null,null,0,0,0,0,0,null,null,null,null,null,null,null,null,null,null,null,null,null,null,null,null,null,null,null,"M"]
[28,{"$f":"CONCATENATE(FILIACION_ESTUDIANTE!B35,\"  \",FILIACION_ESTUDIANTE!C35,\"  \",FILIACION_ESTUDIANTE!D35)","v":"    "},null,null,null,null,null,null,null,null,null,null,null,null,null,null,null,null,null,null,null,null,null,null,null,null,null,null,0,0,0,0,0,null,null,null,null,null,null,null,null,null,null,null,null,null,null,null,null,null,null,null,"M"]
[29,{"$f":"CONCATENATE(FILIACION_ESTUDIANTE!B36,\"  \",FILIACION_ESTUDIANTE!C36,\"  \",FILIACION_ESTUDIANTE!D36)","v":"    "},null,null,null,null,null,null,null,null,null,null,null,null,null,null,null,null,null,null,null,null,null,null,null,null,null,null,0,0,0,0,0]
[30,{"$f":"CONCATENATE(FILIACION_ESTUDIANTE!B37,\"  \",FILIACION_ESTUDIANTE!C37,\"  \",FILIACION_ESTUDIANTE!D37)","v":"    "},null,null,null,null,null,null,null,null,null,null,null,null,null,null,null,null,null,null,null,null,null,null,null,null,null,null,0,0,0,0,0]
[31,{"$f":"CONCATENATE(FILIACION_ESTUDIANTE!B38,\"  \",FILIACION_ESTUDIANTE!C38,\"  \",FILIACION_ESTUDIANTE!D38)","v":"    "},null,null,null,null,null,null,null,null,null,null,null,null,null,null,null,null,null,null,null,null,null,null,null,null,null,null,0,0,0,0,0,null,null,null,null,null,null,null,null,null,null,null,null,null,null,null,null,null,null,null,"M"]
[32,{"$f":"CONCATENATE(FILIACION_ESTUDIANTE!B39,\"  \",FILIACION_ESTUDIANTE!C39,\"  \",FILIACION_ESTUDIANTE!D39)","v":"    "},null,null,null,null,null,null,null,null,null,null,null,null,null,null,null,null,null,null,null,null,null,null,null,null,null,null,0,0,0,0,0,null,null,null,null,null,null,null,null,null,null,null,null,null,null,null,null,null,null,null,"M"]
[33,{"$f":"CONCATENATE(FILIACION_ESTUDIANTE!B40,\"  \",FILIACION_ESTUDIANTE!C40,\"  \",FILIACION_ESTUDIANTE!D40)","v":"    "},null,null,null,null,null,null,null,null,null,null,null,null,null,null,null,null,null,null,null,null,null,null,null,null,null,null,0,0,0,0,0]
[34,{"$f":"CONCATENATE(FILIACION_ESTUDIANTE!B41,\"  \",FILIACION_ESTUDIANTE!C41,\"  \",FILIACION_ESTUDIANTE!D41)","v":"    "},null,null,null,null,null,null,null,null,null,null,null,null,null,null,null,null,null,null,null,null,null,null,null,null,null,null,0,0,0,0,0]
[35,{"$f":"CONCATENATE(FILIACION_ESTUDIANTE!B42,\"  \",FILIACION_ESTUDIANTE!C42,\"  \",FILIACION_ESTUDIANTE!D42)","v":"    "},null,null,null,null,null,null,null,null,null,null,null,null,null,null,null,null,null,null,null,null,null,null,null,null,null,null,0,0,0,0,0]
[36,{"$f":"CONCATENATE(FILIACION_ESTUDIANTE!B43,\"  \",FILIACION_ESTUDIANTE!C43,\"  \",FILIACION_ESTUDIANTE!D43)","v":"    "},null,null,null,null,null,null,null,null,null,null,null,null,null,null,null,null,null,null,null,null,null,null,null,null,null,null,0,0,0,0,0]
[37,{"$f":"CONCATENATE(FILIACION_ESTUDIANTE!B44,\"  \",FILIACION_ESTUDIANTE!C44,\"  \",FILIACION_ESTUDIANTE!D44)","v":"    "},null,null,null,null,null,null,null,null,null,null,null,null,null,null,null,null,null,null,null,null,null,null,null,null,null,null,0,0,0,0,0]
[38,{"$f":"CONCATENATE(FILIACION_ESTUDIANTE!B45,\"  \",FILIACION_ESTUDIANTE!C45,\"  \",FILIACION_ESTUDIANTE!D45)","v":"    "},null,null,null,null,null,null,null,null,null,null,null,null,null,null,null,null,null,null,null,null,null,null,null,null,null,null,0,0,0,0,0]
[39,{"$f":"CONCATENATE(FILIACION_ESTUDIANTE!B46,\"  \",FILIACION_ESTUDIANTE!C46,\"  \",FILIACION_ESTUDIANTE!D46)","v":"    "},null,null,null,null,null,null,null,null,null,null,null,null,null,null,null,null,null,null,null,null,null,null,null,null,null,null,0,0,0,0,0]
[40,{"$f":"CONCATENATE(FILIACION_ESTUDIANTE!B47,\"  \",FILIACION_ESTUDIANTE!C47,\"  \",FILIACION_ESTUDIANTE!D47)","v":"    "},null,null,null,null,null,null,null,null,null,null,null,null,null,null,null,null,null,null,null,null,null,null,null,null,null,null,0,0,0,0,0]
[null,null,null,null,null,null,null,null,null,null,null,null,null,null,null,null,null,null,null,null,null,null,null,null,"TOTAL",null,null,null,{"$f":"SUM(AC9:AC48)","v":0},{"$f":"SUM(AD9:AD48)","v":0},{"$f":"SUM(AE9:AF48)","v":0},null,{"$f":"SUM(AG9:AG48)","v":0}]
[]
[null,null,null,null,null,null,null,null,null,null,null,null,null,null,null,null,null,null,null,null,null,null,null,null,null,null,null,"%"]
[null,null,null,null,null,null,null,null,null,null,null,null,null,null,null,null,null,null,null,null,null,null,"LICENCIA",null,null,null,null,{"$f":"IFERROR(AC49/AG49,\"\")","v":""}]
[null,null,null,null,null,null,null,null,null,null,null,null,null,null,null,null,null,null,null,null,null,null,"FALTA",null,null,null,null,{"$f":"IFERROR(AD49/AG49,\"\")","v":""}]
[null,null,null,null,null,null,null,null,null,null,null,null,null,null,null,null,null,null,null,null,null,null,"PRESENTE",null,null,null,null,{"$f":"IFERROR(AE49/AG49,\"\")","v":""}]
[null,null,null,null,null,null,null,null,null,null,null,null,null,null,null,null,null,null,null,null,null,null,"TOTAL %",null,null,null,null,{"$f":"SUM(AB52:AD54)","v":0}]

{"sheet":"AGOSTO","index":15,"n_rows":56,"n_cols":53,"rows_kept":56,"cut":false,"hidden":false,"merged":[[42,1,42,4],[43,1,43,4],[44,1,44,4],[37,1,37,4],[38,1,38,4],[39,1,39,4],[40,1,40,4],[41,1,41,4],[48,33,49,33],[49,8,49,10],[49,22,49,26],[49,27,49,29],[47,1,47,4],[26,37,26,39],[35,1,35,4],[27,1,27,4],[27,37,27,39],[28,1,28,4],[28,37,28,39],[29,1,29,4],[29,37,29,39],[30,1,30,4],[31,1,31,4],[32,1,32,4],[33,1,33,4],[34,1,34,4],[26,1,26,4],[23,37,23,39],[24,1,24,4],[24,37,24,39],[25,1,25,4],[25,37,25,39],[23,1,23,4],[21,37,21,39],[22,1,22,4],[22,37,22,39],[20,1,20,4],[20,37,20,39],[21,1,21,4],[16,37,18,39],[17,1,17,4],[18,1,18,4],[19,1,19,4],[6,31,7,31],[8,1,8,4],[8,33,47,33],[9,1,9,4],[10,1,10,4],[11,1,11,4],[12,1,12,4],[13,1,13,4],[14,1,14,4],[15,1,15,4],[16,1,16,4],[19,37,19,39],[0,33,0,34],[1,0,1,31],[2,0,2,31],[3,0,3,2],[3,3,3,12],[3,24,3,27],[3,28,3,31],[0,0,0,31],[5,0,5,31],[4,3,4,32],[48,24,48,27],[48,30,48,31],[51,22,51,26],[51,27,51,29],[6,0,7,0],[6,1,7,3],[6,28,7,28],[6,29,7,29],[6,30,7,30],[45,1,45,4],[46,1,46,4],[49,4,49,7],[6,32,7,32],[36,1,36,4],[55,22,55,26],[55,27,55,29],[52,22,52,26],[52,27,52,29],[53,22,53,26],[53,27,53,29],[54,22,54,26],[54,27,54,29]]}
[null,null,null,null,null,null,null,null,null,null,null,null,null,null,null,null,null,null,null,null,null,null,null,null,null,null,null,null,null,null,null,null,null,"ASISTENCIAS E INASISTENCIAS",null,"AZUL"]
[null,null,null,null,null,null,null,null,null,null,null,null,null,null,null,null,null,null,null,null,null,null,null,null,null,null,null,null,null,null,null,null,null,"Presente","P"]
[{"$f":"AL26","v":"REGISTRO DE ASISTENCIA AGOSTO  2019"},null,null,null,null,null,null,null,null,null,null,null,null,null,null,null,null,null,null,null,null,null,null,null,null,null,null,null,null,null,null,null,null,"Atraso","A"]
[{"$f":"+UPPER(CARATULA!C20)","v":"MAESTRA (O):"},null,null,{"$f":"CARATULA!E20","v":0},null,null,null,null,null,null,null,null,null,null,null,null,null,null,null,null,null,null,null,null,"TURNO: ",null,null,null,{"$f":"CARATULA!E13","v":0},null,null,null,null,"falta con licencia","F"]
["PARALELO:",null,null,{"$f":"CARATULA!E14","v":0},null,null,null,null,null,null,null,null,null,null,null,null,null,null,null,null,null,null,null,null,null,null,null,null,null,null,null,null,null,"Falta sin licencia","L"]
[{"$f":"+CONCATENATE(\"AÑO DE ESCOLARIDAD:  \",CARATULA!E21)","v":"AÑO DE ESCOLARIDAD:  "}]
["Nº","NÓMINA",null,null,"DÍA","J","V","L","M","M","J","V","L","M","M","J","V","L",{"$f":"IF(F8=7,\"\",\"M\")","v":"M"},{"$f":"IF(V8>27,\"\",\"M\")","v":"M"},{"$f":"IF(W8>27,\"\",\"J\")","v":"J"},{"$f":"IF(X8>27,\"\",\"V\")","v":"V"},"L","M","M","J","V",null,"LICENCIA (L)","FALTA (F)","ATRASO (A)","PRESENTE (P)","DÍAS TRABAJADOS","dias materias tecnicas",0]
[null,null,null,null,"FECHA",1,{"$f":"F8+1","v":2},{"$f":"G8+3","v":5},{"$f":"H8+1","v":6},7,8,9,{"$f":"L8+3","v":12},13,14,15,16,{"$f":"Q8+3","v":19},20,21,22,23,{"$f":"V8+3","v":26},27,28,29,30,{"$f":"IF($AH$9=\"FEBRERO\",\"\",AA8+1)","v":31}]
[1,{"$f":"CONCATENATE(FILIACION_ESTUDIANTE!B8,\"  \",FILIACION_ESTUDIANTE!C8,\"  \",FILIACION_ESTUDIANTE!D8)","v":"    "},null,null,null,null,null,null,null,null,null,null,null,null,null,null,null,null,null,null,null,null,null,null,null,null,null,null,{"$f":"COUNTIF((F9:AB9),\"L\")","v":0},{"$f":"COUNTIF((F9:AB9),\"F\")","v":0},{"$f":"COUNTIF((F9:AB9),\"A\")","v":0},{"$f":"COUNTIF((F9:AB9),\"P\")","v":0},{"$f":"SUM(AC9:AF9)","v":0},"AGOSTO"]
[2,{"$f":"CONCATENATE(FILIACION_ESTUDIANTE!B9,\"  \",FILIACION_ESTUDIANTE!C9,\"  \",FILIACION_ESTUDIANTE!D9)","v":"    "},null,null,null,null,null,null,null,null,null,null,null,null,null,null,null,null,null,null,null,null,null,null,null,null,null,null,{"$f":"COUNTIF((F10:AB10),\"L\")","v":0},{"$f":"COUNTIF((F10:AB10),\"F\")","v":0},{"$f":"COUNTIF((F10:AB10),\"A\")","v":0},{"$f":"COUNTIF((F10:AB10),\"P\")","v":0},{"$f":"ROUND(SUM(AC10:AF10),)","v":0}]
[3,{"$f":"CONCATENATE(FILIACION_ESTUDIANTE!B10,\"  \",FILIACION_ESTUDIANTE!C10,\"  \",FILIACION_ESTUDIANTE!D10)","v":"    "},null,null,null,null,null,null,null,null,null,null,null,null,null,null,null,null,null,null,null,null,null,null,null,null,null,null,0,0,0,0,0]
[4,{"$f":"CONCATENATE(FILIACION_ESTUDIANTE!B11,\"  \",FILIACION_ESTUDIANTE!C11,\"  \",FILIACION_ESTUDIANTE!D11)","v":"    "},null,null,null,null,null,null,null,null,null,null,null,null,null,null,null,null,null,null,null,null,null,null,null,null,null,null,0,0,0,0,0,null,null,null,null,null,null,null,null,null,null,null,null,null,null,null,null,null,null,{"$f":"ISLOGICAL((#REF!))","v":false},1]
[5,{"$f":"CONCATENATE(FILIACION_ESTUDIANTE!B12,\"  \",FILIACION_ESTUDIANTE!C12,\"  \",FILIACION_ESTUDIANTE!D12)","v":"    "},null,null,null,null,null,null,null,null,null,null,null,null,null,null,null,null,null,null,null,null,null,null,null,null,null,null,0,0,0,0,0,null,null,null,null,null,null,null,null,null,null,null,null,null,null,null,null,null,null,null,"A"]
[6,{"$f":"CONCATENATE(FILIACION_ESTUDIANTE!B13,\"  \",FILIACION_ESTUDIANTE!C13,\"  \",FILIACION_ESTUDIANTE!D13)","v":"    "},null,null,null,null,null,null,null,null,null,null,null,null,null,null,null,null,null,null,null,null,null,null,null,null,null,null,0,0,0,0,0,null,null,null,null,null,null,null,null,null,null,null,null,null,null,null,null,null,{"$f":"ISTEXT(#REF!)","v":false}]
[7,{"$f":"CONCATENATE(FILIACION_ESTUDIANTE!B14,\"  \",FILIACION_ESTUDIANTE!C14,\"  \",FILIACION_ESTUDIANTE!D14)","v":"    "},null,null,null,null,null,null,null,null,null,null,null,null,null,null,null,null,null,null,null,null,null,null,null,null,null,null,0,0,0,0,0,null,null,null,null,null,null,null,null,null,null,null,null,null,null,null,null,null,null,null,"a"]
[8,{"$f":"CONCATENATE(FILIACION_ESTUDIANTE!B15,\"  \",FILIACION_ESTUDIANTE!C15,\"  \",FILIACION_ESTUDIANTE!D15)","v":"    "},null,null,null,null,null,null,null,null,null,null,null,null,null,null,null,null,null,null,null,null,null,null,null,null,null,null,0,0,0,0,0,null,null,null,null,null,null,null,null,null,null,null,null,null,null,null,null,null,null,null,"a"]
[9,{"$f":"CONCATENATE(FILIACION_ESTUDIANTE!B16,\"  \",FILIACION_ESTUDIANTE!C16,\"  \",FILIACION_ESTUDIANTE!D16)","v":"    "},null,null,null,null,null,null,null,null,null,null,null,null,null,null,null,null,null,null,null,null,null,null,null,null,null,null,0,0,0,0,0,null,null,null,null,"ENCABEZADO DE LOS FORMULARIOS DE CONTROL DE ASISTENCIA",null,null,null,null,null,null,null,null,null,null,null,{"$f":"MONTH(AX18)","v":2},null,null,"f"]
[10,{"$f":"CONCATENATE(FILIACION_ESTUDIANTE!B17,\"  \",FILIACION_ESTUDIANTE!C17,\"  \",FILIACION_ESTUDIANTE!D17)","v":"    "},null,null,null,null,null,null,null,null,null,null,null,null,null,null,null,null,null,null,null,null,null,null,null,null,null,null,0,0,0,0,0,null,null,null,null,null,null,null,null,null,null,null,null,null,null,null,null,"2010-02-01",null,null,"f"]
[11,{"$f":"CONCATENATE(FILIACION_ESTUDIANTE!B18,\"  \",FILIACION_ESTUDIANTE!C18,\"  \",FILIACION_ESTUDIANTE!D18)","v":"    "},null,null,null,null,null,null,null,null,null,null,null,null,null,null,null,null,null,null,null,null,null,null,null,null,null,null,0,0,0,0,0,null,null,null,null,null,null,null,null,null,null,null,null,null,null,null,null,null,null,null,"f"]
[12,{"$f":"CONCATENATE(FILIACION_ESTUDIANTE!B19,\"  \",FILIACION_ESTUDIANTE!C19,\"  \",FILIACION_ESTUDIANTE!D19)","v":"    "},null,null,null,null,null,null,null,null,null,null,null,null,null,null,null,null,null,null,null,null,null,null,null,null,null,null,0,0,0,0,0,null,null,null,null,{"$f":"CONCATENATE(AO20,\" \",AP20)","v":"REGISTRO DE ASISTENCIA FEBRERO  2019"},null,null,"REGISTRO DE ASISTENCIA FEBRERO ",{"$f":"CARATULA!F26","v":2019},null,null,null,null,null,null,null,null,null,null,"p"]
[13,{"$f":"CONCATENATE(FILIACION_ESTUDIANTE!B20,\"  \",FILIACION_ESTUDIANTE!C20,\"  \",FILIACION_ESTUDIANTE!D20)","v":"    "},null,null,null,null,null,null,null,null,null,null,null,null,null,null,null,null,null,null,null,null,null,null,null,null,null,null,0,0,0,0,0,null,null,null,null,{"$f":"CONCATENATE(AO21,\" \",AP21)","v":"REGISTRO DE ASISTENCIA MARZO  2019"},null,null,"REGISTRO DE ASISTENCIA MARZO ",{"$f":"AP20","v":2019},null,null,null,null,null,null,null,null,null,null,"y"]
[14,{"$f":"CONCATENATE(FILIACION_ESTUDIANTE!B21,\"  \",FILIACION_ESTUDIANTE!C21,\"  \",FILIACION_ESTUDIANTE!D21)","v":"    "},null,null,null,null,null,null,null,null,null,null,null,null,null,null,null,null,null,null,null,null,null,null,null,null,null,null,0,0,0,0,0,null,null,null,null,"REGISTRO DE ASISTENCIA ABRIL  2019",null,null,"REGISTRO DE ASISTENCIA ABRIL ",{"$f":"AP21","v":2019},null,null,null,null,null,null,null,null,null,null,"a"]
[15,{"$f":"CONCATENATE(FILIACION_ESTUDIANTE!B22,\"  \",FILIACION_ESTUDIANTE!C22,\"  \",FILIACION_ESTUDIANTE!D22)","v":"    "},null,null,null,null,null,null,null,null,null,null,null,null,null,null,null,null,null,null,null,null,null,null,null,null,null,null,0,0,0,0,0,null,null,null,null,"REGISTRO DE ASISTENCIA MAYO  2019",null,null,"REGISTRO DE ASISTENCIA MAYO ",{"$f":"AP22","v":2019},null,null,null,null,null,null,null,null,null,null,"a"]
[16,{"$f":"CONCATENATE(FILIACION_ESTUDIANTE!B23,\"  \",FILIACION_ESTUDIANTE!C23,\"  \",FILIACION_ESTUDIANTE!D23)","v":"    "},null,null,null,null,null,null,null,null,null,null,null,null,null,null,null,null,null,null,null,null,null,null,null,null,null,null,0,0,0,0,0,null,null,null,null,"REGISTRO DE ASISTENCIA JUNIO  2019",null,null,"REGISTRO DE ASISTENCIA JUNIO ",2019,null,null,null,null,null,null,null,null,null,null,"a"]
[17,{"$f":"CONCATENATE(FILIACION_ESTUDIANTE!B24,\"  \",FILIACION_ESTUDIANTE!C24,\"  \",FILIACION_ESTUDIANTE!D24)","v":"    "},null,null,null,null,null,null,null,null,null,null,null,null,null,null,null,null,null,null,null,null,null,null,null,null,null,null,0,0,0,0,0,null,null,null,null,"REGISTRO DE ASISTENCIA JULIO  2019",null,null,"REGISTRO DE ASISTENCIA JULIO ",2019,null,null,null,null,null,null,null,null,null,null,"a"]
[18,{"$f":"CONCATENATE(FILIACION_ESTUDIANTE!B25,\"  \",FILIACION_ESTUDIANTE!C25,\"  \",FILIACION_ESTUDIANTE!D25)","v":"    "},null,null,null,null,null,null,null,null,null,null,null,null,null,null,null,null,null,null,null,null,null,null,null,null,null,null,0,0,0,0,0,null,null,null,null,"REGISTRO DE ASISTENCIA AGOSTO  2019",null,null,"REGISTRO DE ASISTENCIA AGOSTO ",2019,null,null,null,null,null,null,null,null,null,null,"a"]
[19,{"$f":"CONCATENATE(FILIACION_ESTUDIANTE!B26,\"  \",FILIACION_ESTUDIANTE!C26,\"  \",FILIACION_ESTUDIANTE!D26)","v":"    "},null,null,null,null,null,null,null,null,null,null,null,null,null,null,null,null,null,null,null,null,null,null,null,null,null,null,0,0,0,0,0,null,null,null,null,"REGISTRO DE ASISTENCIA SEPTIEMBRE  2019",null,null,"REGISTRO DE ASISTENCIA SEPTIEMBRE ",2019,null,null,null,null,null,null,null,null,null,null,"a"]
[20,{"$f":"CONCATENATE(FILIACION_ESTUDIANTE!B27,\"  \",FILIACION_ESTUDIANTE!C27,\"  \",FILIACION_ESTUDIANTE!D27)","v":"    "},null,null,null,null,null,null,null,null,null,null,null,null,null,null,null,null,null,null,null,null,null,null,null,null,null,null,0,0,0,0,0,null,null,null,null,"REGISTRO DE ASISTENCIA OCTUBRE  2019",null,null,"REGISTRO DE ASISTENCIA OCTUBRE ",2019,null,null,null,null,null,null,null,null,null,null,"f"]
[21,{"$f":"CONCATENATE(FILIACION_ESTUDIANTE!B28,\"  \",FILIACION_ESTUDIANTE!C28,\"  \",FILIACION_ESTUDIANTE!D28)","v":"    "},null,null,null,null,null,null,null,null,null,null,null,null,null,null,null,null,null,null,null,null,null,null,null,null,null,null,0,0,0,0,0,null,null,null,null,"REGISTRO DE ASISTENCIA NOVIEMBRE  2019",null,null,"REGISTRO DE ASISTENCIA NOVIEMBRE ",2019,null,null,null,null,null,null,null,null,null,null,"p"]
[22,{"$f":"CONCATENATE(FILIACION_ESTUDIANTE!B29,\"  \",FILIACION_ESTUDIANTE!C29,\"  \",FILIACION_ESTUDIANTE!D29)","v":"    "},null,null,null,null,null,null,null,null,null,null,null,null,null,null,null,null,null,null,null,null,null,null,null,null,null,null,0,0,0,0,0,null,null,null,null,"REGISTRO DE ASISTENCIA DICIEMBRE  2019",null,null,"REGISTRO DE ASISTENCIA DICIEMBRE ",2019,null,null,null,null,null,null,null,null,null,null,"M"]
[23,{"$f":"CONCATENATE(FILIACION_ESTUDIANTE!B30,\"  \",FILIACION_ESTUDIANTE!C30,\"  \",FILIACION_ESTUDIANTE!D30)","v":"    "},null,null,null,null,null,null,null,null,null,null,null,null,null,null,null,null,null,null,null,null,null,null,null,null,null,null,0,0,0,0,0]
[24,{"$f":"CONCATENATE(FILIACION_ESTUDIANTE!B31,\"  \",FILIACION_ESTUDIANTE!C31,\"  \",FILIACION_ESTUDIANTE!D31)","v":"    "},null,null,null,null,null,null,null,null,null,null,null,null,null,null,null,null,null,null,null,null,null,null,null,null,null,null,0,0,0,0,0,null,null,null,null,null,null,null,null,null,null,null,null,null,null,null,null,null,null,null,"M"]
[25,{"$f":"CONCATENATE(FILIACION_ESTUDIANTE!B32,\"  \",FILIACION_ESTUDIANTE!C32,\"  \",FILIACION_ESTUDIANTE!D32)","v":"    "},null,null,null,null,null,null,null,null,null,null,null,null,null,null,null,null,null,null,null,null,null,null,null,null,null,null,0,0,0,0,0,null,null,null,null,null,null,null,null,null,null,null,null,null,null,null,null,null,null,null,"M"]
[26,{"$f":"CONCATENATE(FILIACION_ESTUDIANTE!B33,\"  \",FILIACION_ESTUDIANTE!C33,\"  \",FILIACION_ESTUDIANTE!D33)","v":"    "},null,null,null,null,null,null,null,null,null,null,null,null,null,null,null,null,null,null,null,null,null,null,null,null,null,null,0,0,0,0,0,null,null,null,null,null,null,null,null,null,null,null,null,null,null,null,null,null,null,null,"M"]
[27,{"$f":"CONCATENATE(FILIACION_ESTUDIANTE!B34,\"  \",FILIACION_ESTUDIANTE!C34,\"  \",FILIACION_ESTUDIANTE!D34)","v":"    "},null,null,null,null,null,null,null,null,null,null,null,null,null,null,null,null,null,null,null,null,null,null,null,null,null,null,0,0,0,0,0,null,null,null,null,null,null,null,null,null,null,null,null,null,null,null,null,null,null,null,"M"]
[28,{"$f":"CONCATENATE(FILIACION_ESTUDIANTE!B35,\"  \",FILIACION_ESTUDIANTE!C35,\"  \",FILIACION_ESTUDIANTE!D35)","v":"    "},null,null,null,null,null,null,null,null,null,null,null,null,null,null,null,null,null,null,null,null,null,null,null,null,null,null,0,0,0,0,0,null,null,null,null,null,null,null,null,null,null,null,null,null,null,null,null,null,null,null,"M"]
[29,{"$f":"CONCATENATE(FILIACION_ESTUDIANTE!B36,\"  \",FILIACION_ESTUDIANTE!C36,\"  \",FILIACION_ESTUDIANTE!D36)","v":"    "},null,null,null,null,null,null,null,null,null,null,null,null,null,null,null,null,null,null,null,null,null,null,null,null,null,null,0,0,0,0,0]
[30,{"$f":"CONCATENATE(FILIACION_ESTUDIANTE!B37,\"  \",FILIACION_ESTUDIANTE!C37,\"  \",FILIACION_ESTUDIANTE!D37)","v":"    "},null,null,null,null,null,null,null,null,null,null,null,null,null,null,null,null,null,null,null,null,null,null,null,null,null,null,0,0,0,0,0]
[31,{"$f":"CONCATENATE(FILIACION_ESTUDIANTE!B38,\"  \",FILIACION_ESTUDIANTE!C38,\"  \",FILIACION_ESTUDIANTE!D38)","v":"    "},null,null,null,null,null,null,null,null,null,null,null,null,null,null,null,null,null,null,null,null,null,null,null,null,null,null,0,0,0,0,0,null,null,null,null,null,null,null,null,null,null,null,null,null,null,null,null,null,null,null,"M"]
[32,{"$f":"CONCATENATE(FILIACION_ESTUDIANTE!B39,\"  \",FILIACION_ESTUDIANTE!C39,\"  \",FILIACION_ESTUDIANTE!D39)","v":"    "},null,null,null,null,null,null,null,null,null,null,null,null,null,null,null,null,null,null,null,null,null,null,null,null,null,null,0,0,0,0,0,null,null,null,null,null,null,null,null,null,null,null,null,null,null,null,null,null,null,null,"M"]
[33,{"$f":"CONCATENATE(FILIACION_ESTUDIANTE!B40,\"  \",FILIACION_ESTUDIANTE!C40,\"  \",FILIACION_ESTUDIANTE!D40)","v":"    "},null,null,null,null,null,null,null,null,null,null,null,null,null,null,null,null,null,null,null,null,null,null,null,null,null,null,0,0,0,0,0]
[34,{"$f":"CONCATENATE(FILIACION_ESTUDIANTE!B41,\"  \",FILIACION_ESTUDIANTE!C41,\"  \",FILIACION_ESTUDIANTE!D41)","v":"    "},null,null,null,null,null,null,null,null,null,null,null,null,null,null,null,null,null,null,null,null,null,null,null,null,null,null,0,0,0,0,0]
[35,{"$f":"CONCATENATE(FILIACION_ESTUDIANTE!B42,\"  \",FILIACION_ESTUDIANTE!C42,\"  \",FILIACION_ESTUDIANTE!D42)","v":"    "},null,null,null,null,null,null,null,null,null,null,null,null,null,null,null,null,null,null,null,null,null,null,null,null,null,null,0,0,0,0,0]
[36,{"$f":"CONCATENATE(FILIACION_ESTUDIANTE!B43,\"  \",FILIACION_ESTUDIANTE!C43,\"  \",FILIACION_ESTUDIANTE!D43)","v":"    "},null,null,null,null,null,null,null,null,null,null,null,null,null,null,null,null,null,null,null,null,null,null,null,null,null,null,0,0,0,0,0]
[37,{"$f":"CONCATENATE(FILIACION_ESTUDIANTE!B44,\"  \",FILIACION_ESTUDIANTE!C44,\"  \",FILIACION_ESTUDIANTE!D44)","v":"    "},null,null,null,null,null,null,null,null,null,null,null,null,null,null,null,null,null,null,null,null,null,null,null,null,null,null,0,0,0,0,0]
[38,{"$f":"CONCATENATE(FILIACION_ESTUDIANTE!B45,\"  \",FILIACION_ESTUDIANTE!C45,\"  \",FILIACION_ESTUDIANTE!D45)","v":"    "},null,null,null,null,null,null,null,null,null,null,null,null,null,null,null,null,null,null,null,null,null,null,null,null,null,null,0,0,0,0,0]
[39,{"$f":"CONCATENATE(FILIACION_ESTUDIANTE!B46,\"  \",FILIACION_ESTUDIANTE!C46,\"  \",FILIACION_ESTUDIANTE!D46)","v":"    "},null,null,null,null,null,null,null,null,null,null,null,null,null,null,null,null,null,null,null,null,null,null,null,null,null,null,0,0,0,0,0]
[40,{"$f":"CONCATENATE(FILIACION_ESTUDIANTE!B47,\"  \",FILIACION_ESTUDIANTE!C47,\"  \",FILIACION_ESTUDIANTE!D47)","v":"    "},null,null,null,null,null,null,null,null,null,null,null,null,null,null,null,null,null,null,null,null,null,null,null,null,null,null,0,0,0,0,0]
[null,null,null,null,null,null,null,null,null,null,null,null,null,null,null,null,null,null,null,null,null,null,null,null,"TOTAL",null,null,null,{"$f":"SUM(AC9:AC48)","v":0},{"$f":"SUM(AD9:AD48)","v":0},{"$f":"SUM(AE9:AF48)","v":0},null,{"$f":"SUM(AG9:AG48)","v":0}]
[null,null,null,null,null,null,null,null,null,null,null,null,null,null,null,null,null,null,null,null,null,null,null,null,null,null,null,null,null,null,null,null,null,null,null,{"$f":"(SUM(AF9:AF48,AC9:AD48)/#REF!)","v":{"$error":"#REF!"}},"SUMATORIA","DIAS TRAB","PROMEDIO"]
[]
[null,null,null,null,null,null,null,null,null,null,null,null,null,null,null,null,null,null,null,null,null,null,null,null,null,null,null,"%"]
[null,null,null,null,null,null,null,null,null,null,null,null,null,null,null,null,null,null,null,null,null,null,"LICENCIA",null,null,null,null,{"$f":"AC49/AG49","v":{"$error":"#DIV/0!"}}]
[null,null,null,null,null,null,null,null,null,null,null,null,null,null,null,null,null,null,null,null,null,null,"FALTA",null,null,null,null,{"$f":"AD49/AG49","v":{"$error":"#DIV/0!"}}]
[null,null,null,null,null,null,null,null,null,null,null,null,null,null,null,null,null,null,null,null,null,null,"PRESENTE",null,null,null,null,{"$f":"AE49/AG49","v":{"$error":"#DIV/0!"}}]
[null,null,null,null,null,null,null,null,null,null,null,null,null,null,null,null,null,null,null,null,null,null,"TOTAL %",null,null,null,null,{"$f":"SUM(AB53:AD55)","v":{"$error":"#DIV/0!"}}]

{"sheet":"SEPTIEMBRE","index":16,"n_rows":56,"n_cols":53,"rows_kept":56,"cut":false,"hidden":false,"merged":[[42,1,42,4],[43,1,43,4],[44,1,44,4],[37,1,37,4],[38,1,38,4],[39,1,39,4],[40,1,40,4],[41,1,41,4],[48,33,49,33],[49,8,49,10],[49,22,49,26],[49,27,49,29],[47,1,47,4],[26,37,26,39],[35,1,35,4],[27,1,27,4],[27,37,27,39],[28,1,28,4],[28,37,28,39],[29,1,29,4],[29,37,29,39],[30,1,30,4],[31,1,31,4],[32,1,32,4],[33,1,33,4],[34,1,34,4],[26,1,26,4],[23,37,23,39],[24,1,24,4],[24,37,24,39],[25,1,25,4],[25,37,25,39],[23,1,23,4],[21,37,21,39],[22,1,22,4],[22,37,22,39],[20,1,20,4],[20,37,20,39],[21,1,21,4],[16,37,18,39],[17,1,17,4],[18,1,18,4],[19,1,19,4],[6,31,7,31],[8,1,8,4],[8,33,47,33],[9,1,9,4],[10,1,10,4],[11,1,11,4],[12,1,12,4],[13,1,13,4],[14,1,14,4],[15,1,15,4],[16,1,16,4],[19,37,19,39],[0,33,0,34],[1,0,1,31],[2,0,2,31],[3,0,3,2],[3,3,3,12],[3,24,3,27],[3,28,3,31],[0,0,0,31],[5,0,5,31],[4,3,4,32],[48,24,48,27],[48,30,48,31],[51,22,51,26],[51,27,51,29],[6,0,7,0],[6,1,7,3],[6,28,7,28],[6,29,7,29],[6,30,7,30],[45,1,45,4],[46,1,46,4],[49,4,49,7],[6,32,7,32],[36,1,36,4],[55,22,55,26],[55,27,55,29],[52,22,52,26],[52,27,52,29],[53,22,53,26],[53,27,53,29],[54,22,54,26],[54,27,54,29]]}
[null,null,null,null,null,null,null,null,null,null,null,null,null,null,null,null,null,null,null,null,null,null,null,null,null,null,null,null,null,null,null,null,null,"ASISTENCIAS E INASISTENCIAS",null,"AZUL"]
[null,null,null,null,null,null,null,null,null,null,null,null,null,null,null,null,null,null,null,null,null,null,null,null,null,null,null,null,null,null,null,null,null,"Presente","P"]
[{"$f":"AL27","v":"REGISTRO DE ASISTENCIA SEPTIEMBRE  2019"},null,null,null,null,null,null,null,null,null,null,null,null,null,null,null,null,null,null,null,null,null,null,null,null,null,null,null,null,null,null,null,null,"Atraso","A"]
[{"$f":"+UPPER(CARATULA!C20)","v":"MAESTRA (O):"},null,null,{"$f":"CARATULA!E20","v":0},null,null,null,null,null,null,null,null,null,null,null,null,null,null,null,null,null,null,null,null,"TURNO: ",null,null,null,{"$f":"CARATULA!E13","v":0},null,null,null,null,"falta con licencia","F"]
["PARALELO:",null,null,{"$f":"CARATULA!E14","v":0},null,null,null,null,null,null,null,null,null,null,null,null,null,null,null,null,null,null,null,null,null,null,null,null,null,null,null,null,null,"Falta sin licencia","L"]
[{"$f":"+CONCATENATE(\"AÑO DE ESCOLARIDAD:  \",CARATULA!E21)","v":"AÑO DE ESCOLARIDAD:  "}]
["Nº","NÓMINA",null,null,"DÍA","L","M","M","J","V","L","M","M","J","V","L","M","M","J","V","L",{"$f":"IF(F8=7,\"\",\"M\")","v":"M"},{"$f":"IF(V8>27,\"\",\"M\")","v":"M"},{"$f":"IF(W8>27,\"\",\"J\")","v":"J"},{"$f":"IF(X8>27,\"\",\"V\")","v":"V"},"L",null,null,"LICENCIA (L)","FALTA (F)","ATRASO (A)","PRESENTE (P)","DÍAS TRABAJADOS","dias materias tecnicas",0]
[null,null,null,null,"FECHA",2,{"$f":"F8+1","v":3},{"$f":"G8+1","v":4},{"$f":"H8+1","v":5},{"$f":"I8+1","v":6},{"$f":"J8+3","v":9},{"$f":"K8+1","v":10},{"$f":"L8+1","v":11},{"$f":"M8+1","v":12},{"$f":"N8+1","v":13},{"$f":"O8+3","v":16},{"$f":"P8+1","v":17},{"$f":"Q8+1","v":18},{"$f":"R8+1","v":19},{"$f":"S8+1","v":20},{"$f":"T8+3","v":23},{"$f":"IF(F8=7,\"\",U8+1)","v":24},{"$f":"IF(V8>27,\"\",V8+1)","v":25},{"$f":"IF(W8>27,\"\",W8+1)","v":26},{"$f":"IF(X8>27,\"\",X8+1)","v":27},{"$f":"+Y8+3","v":30}]
[1,{"$f":"CONCATENATE(FILIACION_ESTUDIANTE!B8,\"  \",FILIACION_ESTUDIANTE!C8,\"  \",FILIACION_ESTUDIANTE!D8)","v":"    "},null,null,null,null,null,null,null,null,null,null,null,null,null,null,null,null,null,null,null,null,null,null,null,null,null,null,{"$f":"COUNTIF((F9:AB9),\"L\")","v":0},{"$f":"COUNTIF((F9:AB9),\"F\")","v":0},{"$f":"COUNTIF((F9:AB9),\"A\")","v":0},{"$f":"COUNTIF((F9:AB9),\"P\")","v":0},{"$f":"ROUND(SUM(AC9:AF9),)","v":0}]
[2,{"$f":"CONCATENATE(FILIACION_ESTUDIANTE!B9,\"  \",FILIACION_ESTUDIANTE!C9,\"  \",FILIACION_ESTUDIANTE!D9)","v":"    "},null,null,null,null,null,null,null,null,null,null,null,null,null,null,null,null,null,null,null,null,null,null,null,null,null,null,{"$f":"COUNTIF((F10:AB10),\"L\")","v":0},{"$f":"COUNTIF((F10:AB10),\"F\")","v":0},{"$f":"COUNTIF((F10:AB10),\"A\")","v":0},{"$f":"COUNTIF((F10:AB10),\"P\")","v":0},0]
[3,{"$f":"CONCATENATE(FILIACION_ESTUDIANTE!B10,\"  \",FILIACION_ESTUDIANTE!C10,\"  \",FILIACION_ESTUDIANTE!D10)","v":"    "},null,null,null,null,null,null,null,null,null,null,null,null,null,null,null,null,null,null,null,null,null,null,null,null,null,null,0,0,0,0,0]
[4,{"$f":"CONCATENATE(FILIACION_ESTUDIANTE!B11,\"  \",FILIACION_ESTUDIANTE!C11,\"  \",FILIACION_ESTUDIANTE!D11)","v":"    "},null,null,null,null,null,null,null,null,null,null,null,null,null,null,null,null,null,null,null,null,null,null,null,null,null,null,0,0,0,0,0,null,null,null,null,null,null,null,null,null,null,null,null,null,null,null,null,null,null,{"$f":"ISLOGICAL((#REF!))","v":false},1]
[5,{"$f":"CONCATENATE(FILIACION_ESTUDIANTE!B12,\"  \",FILIACION_ESTUDIANTE!C12,\"  \",FILIACION_ESTUDIANTE!D12)","v":"    "},null,null,null,null,null,null,null,null,null,null,null,null,null,null,null,null,null,null,null,null,null,null,null,null,null,null,0,0,0,0,0,null,null,null,null,null,null,null,null,null,null,null,null,null,null,null,null,null,null,null,"A"]
[6,{"$f":"CONCATENATE(FILIACION_ESTUDIANTE!B13,\"  \",FILIACION_ESTUDIANTE!C13,\"  \",FILIACION_ESTUDIANTE!D13)","v":"    "},null,null,null,null,null,null,null,null,null,null,null,null,null,null,null,null,null,null,null,null,null,null,null,null,null,null,0,0,0,0,0,null,null,null,null,null,null,null,null,null,null,null,null,null,null,null,null,null,{"$f":"ISTEXT(#REF!)","v":false}]
[7,{"$f":"CONCATENATE(FILIACION_ESTUDIANTE!B14,\"  \",FILIACION_ESTUDIANTE!C14,\"  \",FILIACION_ESTUDIANTE!D14)","v":"    "},null,null,null,null,null,null,null,null,null,null,null,null,null,null,null,null,null,null,null,null,null,null,null,null,null,null,0,0,0,0,0,null,null,null,null,null,null,null,null,null,null,null,null,null,null,null,null,null,null,null,"a"]
[8,{"$f":"CONCATENATE(FILIACION_ESTUDIANTE!B15,\"  \",FILIACION_ESTUDIANTE!C15,\"  \",FILIACION_ESTUDIANTE!D15)","v":"    "},null,null,null,null,null,null,null,null,null,null,null,null,null,null,null,null,null,null,null,null,null,null,null,null,null,null,0,0,0,0,0,null,null,null,null,null,null,null,null,null,null,null,null,null,null,null,null,null,null,null,"a"]
[9,{"$f":"CONCATENATE(FILIACION_ESTUDIANTE!B16,\"  \",FILIACION_ESTUDIANTE!C16,\"  \",FILIACION_ESTUDIANTE!D16)","v":"    "},null,null,null,null,null,null,null,null,null,null,null,null,null,null,null,null,null,null,null,null,null,null,null,null,null,null,0,0,0,0,0,null,null,null,null,"ENCABEZADO DE LOS FORMULARIOS DE CONTROL DE ASISTENCIA",null,null,null,null,null,null,null,null,null,null,null,{"$f":"MONTH(AX18)","v":2},null,null,"f"]
[10,{"$f":"CONCATENATE(FILIACION_ESTUDIANTE!B17,\"  \",FILIACION_ESTUDIANTE!C17,\"  \",FILIACION_ESTUDIANTE!D17)","v":"    "},null,null,null,null,null,null,null,null,null,null,null,null,null,null,null,null,null,null,null,null,null,null,null,null,null,null,0,0,0,0,0,null,null,null,null,null,null,null,null,null,null,null,null,null,null,null,null,"2010-02-01",null,null,"f"]
[11,{"$f":"CONCATENATE(FILIACION_ESTUDIANTE!B18,\"  \",FILIACION_ESTUDIANTE!C18,\"  \",FILIACION_ESTUDIANTE!D18)","v":"    "},null,null,null,null,null,null,null,null,null,null,null,null,null,null,null,null,null,null,null,null,null,null,null,null,null,null,0,0,0,0,0,null,null,null,null,null,null,null,null,null,null,null,null,null,null,null,null,null,null,null,"f"]
[12,{"$f":"CONCATENATE(FILIACION_ESTUDIANTE!B19,\"  \",FILIACION_ESTUDIANTE!C19,\"  \",FILIACION_ESTUDIANTE!D19)","v":"    "},null,null,null,null,null,null,null,null,null,null,null,null,null,null,null,null,null,null,null,null,null,null,null,null,null,null,0,0,0,0,0,null,null,null,null,{"$f":"CONCATENATE(AO20,\" \",AP20)","v":"REGISTRO DE ASISTENCIA FEBRERO  2019"},null,null,"REGISTRO DE ASISTENCIA FEBRERO ",{"$f":"CARATULA!F26","v":2019},null,null,null,null,null,null,null,null,null,null,"p"]
[13,{"$f":"CONCATENATE(FILIACION_ESTUDIANTE!B20,\"  \",FILIACION_ESTUDIANTE!C20,\"  \",FILIACION_ESTUDIANTE!D20)","v":"    "},null,null,null,null,null,null,null,null,null,null,null,null,null,null,null,null,null,null,null,null,null,null,null,null,null,null,0,0,0,0,0,null,null,null,null,{"$f":"CONCATENATE(AO21,\" \",AP21)","v":"REGISTRO DE ASISTENCIA MARZO  2019"},null,null,"REGISTRO DE ASISTENCIA MARZO ",{"$f":"AP20","v":2019},null,null,null,null,null,null,null,null,null,null,"y"]
[14,{"$f":"CONCATENATE(FILIACION_ESTUDIANTE!B21,\"  \",FILIACION_ESTUDIANTE!C21,\"  \",FILIACION_ESTUDIANTE!D21)","v":"    "},null,null,null,null,null,null,null,null,null,null,null,null,null,null,null,null,null,null,null,null,null,null,null,null,null,null,0,0,0,0,0,null,null,null,null,"REGISTRO DE ASISTENCIA ABRIL  2019",null,null,"REGISTRO DE ASISTENCIA ABRIL ",{"$f":"AP21","v":2019},null,null,null,null,null,null,null,null,null,null,"a"]
[15,{"$f":"CONCATENATE(FILIACION_ESTUDIANTE!B22,\"  \",FILIACION_ESTUDIANTE!C22,\"  \",FILIACION_ESTUDIANTE!D22)","v":"    "},null,null,null,null,null,null,null,null,null,null,null,null,null,null,null,null,null,null,null,null,null,null,null,null,null,null,0,0,0,0,0,null,null,null,null,"REGISTRO DE ASISTENCIA MAYO  2019",null,null,"REGISTRO DE ASISTENCIA MAYO ",{"$f":"AP22","v":2019},null,null,null,null,null,null,null,null,null,null,"a"]
[16,{"$f":"CONCATENATE(FILIACION_ESTUDIANTE!B23,\"  \",FILIACION_ESTUDIANTE!C23,\"  \",FILIACION_ESTUDIANTE!D23)","v":"    "},null,null,null,null,null,null,null,null,null,null,null,null,null,null,null,null,null,null,null,null,null,null,null,null,null,null,0,0,0,0,0,null,null,null,null,"REGISTRO DE ASISTENCIA JUNIO  2019",null,null,"REGISTRO DE ASISTENCIA JUNIO ",2019,null,null,null,null,null,null,null,null,null,null,"a"]
[17,{"$f":"CONCATENATE(FILIACION_ESTUDIANTE!B24,\"  \",FILIACION_ESTUDIANTE!C24,\"  \",FILIACION_ESTUDIANTE!D24)","v":"    "},null,null,null,null,null,null,null,null,null,null,null,null,null,null,null,null,null,null,null,null,null,null,null,null,null,null,0,0,0,0,0,null,null,null,null,"REGISTRO DE ASISTENCIA JULIO  2019",null,null,"REGISTRO DE ASISTENCIA JULIO ",2019,null,null,null,null,null,null,null,null,null,null,"a"]
[18,{"$f":"CONCATENATE(FILIACION_ESTUDIANTE!B25,\"  \",FILIACION_ESTUDIANTE!C25,\"  \",FILIACION_ESTUDIANTE!D25)","v":"    "},null,null,null,null,null,null,null,null,null,null,null,null,null,null,null,null,null,null,null,null,null,null,null,null,null,null,0,0,0,0,0,null,null,null,null,"REGISTRO DE ASISTENCIA AGOSTO  2019",null,null,"REGISTRO DE ASISTENCIA AGOSTO ",2019,null,null,null,null,null,null,null,null,null,null,"a"]
[19,{"$f":"CONCATENATE(FILIACION_ESTUDIANTE!B26,\"  \",FILIACION_ESTUDIANTE!C26,\"  \",FILIACION_ESTUDIANTE!D26)","v":"    "},null,null,null,null,null,null,null,null,null,null,null,null,null,null,null,null,null,null,null,null,null,null,null,null,null,null,0,0,0,0,0,null,null,null,null,"REGISTRO DE ASISTENCIA SEPTIEMBRE  2019",null,null,"REGISTRO DE ASISTENCIA SEPTIEMBRE ",2019,null,null,null,null,null,null,null,null,null,null,"a"]
[20,{"$f":"CONCATENATE(FILIACION_ESTUDIANTE!B27,\"  \",FILIACION_ESTUDIANTE!C27,\"  \",FILIACION_ESTUDIANTE!D27)","v":"    "},null,null,null,null,null,null,null,null,null,null,null,null,null,null,null,null,null,null,null,null,null,null,null,null,null,null,0,0,0,0,0,null,null,null,null,"REGISTRO DE ASISTENCIA OCTUBRE  2019",null,null,"REGISTRO DE ASISTENCIA OCTUBRE ",2019,null,null,null,null,null,null,null,null,null,null,"f"]
[21,{"$f":"CONCATENATE(FILIACION_ESTUDIANTE!B28,\"  \",FILIACION_ESTUDIANTE!C28,\"  \",FILIACION_ESTUDIANTE!D28)","v":"    "},null,null,null,null,null,null,null,null,null,null,null,null,null,null,null,null,null,null,null,null,null,null,null,null,null,null,0,0,0,0,0,null,null,null,null,"REGISTRO DE ASISTENCIA NOVIEMBRE  2019",null,null,"REGISTRO DE ASISTENCIA NOVIEMBRE ",2019,null,null,null,null,null,null,null,null,null,null,"p"]
[22,{"$f":"CONCATENATE(FILIACION_ESTUDIANTE!B29,\"  \",FILIACION_ESTUDIANTE!C29,\"  \",FILIACION_ESTUDIANTE!D29)","v":"    "},null,null,null,null,null,null,null,null,null,null,null,null,null,null,null,null,null,null,null,null,null,null,null,null,null,null,0,0,0,0,0,null,null,null,null,"REGISTRO DE ASISTENCIA DICIEMBRE  2019",null,null,"REGISTRO DE ASISTENCIA DICIEMBRE ",2019,null,null,null,null,null,null,null,null,null,null,"M"]
[23,{"$f":"CONCATENATE(FILIACION_ESTUDIANTE!B30,\"  \",FILIACION_ESTUDIANTE!C30,\"  \",FILIACION_ESTUDIANTE!D30)","v":"    "},null,null,null,null,null,null,null,null,null,null,null,null,null,null,null,null,null,null,null,null,null,null,null,null,null,null,0,0,0,0,0]
[24,{"$f":"CONCATENATE(FILIACION_ESTUDIANTE!B31,\"  \",FILIACION_ESTUDIANTE!C31,\"  \",FILIACION_ESTUDIANTE!D31)","v":"    "},null,null,null,null,null,null,null,null,null,null,null,null,null,null,null,null,null,null,null,null,null,null,null,null,null,null,0,0,0,0,0,null,null,null,null,null,null,null,null,null,null,null,null,null,null,null,null,null,null,null,"M"]
[25,{"$f":"CONCATENATE(FILIACION_ESTUDIANTE!B32,\"  \",FILIACION_ESTUDIANTE!C32,\"  \",FILIACION_ESTUDIANTE!D32)","v":"    "},null,null,null,null,null,null,null,null,null,null,null,null,null,null,null,null,null,null,null,null,null,null,null,null,null,null,0,0,0,0,0,null,null,null,null,null,null,null,null,null,null,null,null,null,null,null,null,null,null,null,"M"]
[26,{"$f":"CONCATENATE(FILIACION_ESTUDIANTE!B33,\"  \",FILIACION_ESTUDIANTE!C33,\"  \",FILIACION_ESTUDIANTE!D33)","v":"    "},null,null,null,null,null,null,null,null,null,null,null,null,null,null,null,null,null,null,null,null,null,null,null,null,null,null,0,0,0,0,0,null,null,null,null,null,null,null,null,null,null,null,null,null,null,null,null,null,null,null,"M"]
[27,{"$f":"CONCATENATE(FILIACION_ESTUDIANTE!B34,\"  \",FILIACION_ESTUDIANTE!C34,\"  \",FILIACION_ESTUDIANTE!D34)","v":"    "},null,null,null,null,null,null,null,null,null,null,null,null,null,null,null,null,null,null,null,null,null,null,null,null,null,null,0,0,0,0,0,null,null,null,null,null,null,null,null,null,null,null,null,null,null,null,null,null,null,null,"M"]
[28,{"$f":"CONCATENATE(FILIACION_ESTUDIANTE!B35,\"  \",FILIACION_ESTUDIANTE!C35,\"  \",FILIACION_ESTUDIANTE!D35)","v":"    "},null,null,null,null,null,null,null,null,null,null,null,null,null,null,null,null,null,null,null,null,null,null,null,null,null,null,0,0,0,0,0,null,null,null,null,null,null,null,null,null,null,null,null,null,null,null,null,null,null,null,"M"]
[29,{"$f":"CONCATENATE(FILIACION_ESTUDIANTE!B36,\"  \",FILIACION_ESTUDIANTE!C36,\"  \",FILIACION_ESTUDIANTE!D36)","v":"    "},null,null,null,null,null,null,null,null,null,null,null,null,null,null,null,null,null,null,null,null,null,null,null,null,null,null,0,0,0,0,0]
[30,{"$f":"CONCATENATE(FILIACION_ESTUDIANTE!B37,\"  \",FILIACION_ESTUDIANTE!C37,\"  \",FILIACION_ESTUDIANTE!D37)","v":"    "},null,null,null,null,null,null,null,null,null,null,null,null,null,null,null,null,null,null,null,null,null,null,null,null,null,null,0,0,0,0,0]
[31,{"$f":"CONCATENATE(FILIACION_ESTUDIANTE!B38,\"  \",FILIACION_ESTUDIANTE!C38,\"  \",FILIACION_ESTUDIANTE!D38)","v":"    "},null,null,null,null,null,null,null,null,null,null,null,null,null,null,null,null,null,null,null,null,null,null,null,null,null,null,0,0,0,0,0,null,null,null,null,null,null,null,null,null,null,null,null,null,null,null,null,null,null,null,"M"]
[32,{"$f":"CONCATENATE(FILIACION_ESTUDIANTE!B39,\"  \",FILIACION_ESTUDIANTE!C39,\"  \",FILIACION_ESTUDIANTE!D39)","v":"    "},null,null,null,null,null,null,null,null,null,null,null,null,null,null,null,null,null,null,null,null,null,null,null,null,null,null,0,0,0,0,0,null,null,null,null,null,null,null,null,null,null,null,null,null,null,null,null,null,null,null,"M"]
[33,{"$f":"CONCATENATE(FILIACION_ESTUDIANTE!B40,\"  \",FILIACION_ESTUDIANTE!C40,\"  \",FILIACION_ESTUDIANTE!D40)","v":"    "},null,null,null,null,null,null,null,null,null,null,null,null,null,null,null,null,null,null,null,null,null,null,null,null,null,null,0,0,0,0,0]
[34,{"$f":"CONCATENATE(FILIACION_ESTUDIANTE!B41,\"  \",FILIACION_ESTUDIANTE!C41,\"  \",FILIACION_ESTUDIANTE!D41)","v":"    "},null,null,null,null,null,null,null,null,null,null,null,null,null,null,null,null,null,null,null,null,null,null,null,null,null,null,0,0,0,0,0]
[35,{"$f":"CONCATENATE(FILIACION_ESTUDIANTE!B42,\"  \",FILIACION_ESTUDIANTE!C42,\"  \",FILIACION_ESTUDIANTE!D42)","v":"    "},null,null,null,null,null,null,null,null,null,null,null,null,null,null,null,null,null,null,null,null,null,null,null,null,null,null,0,0,0,0,0]
[36,{"$f":"CONCATENATE(FILIACION_ESTUDIANTE!B43,\"  \",FILIACION_ESTUDIANTE!C43,\"  \",FILIACION_ESTUDIANTE!D43)","v":"    "},null,null,null,null,null,null,null,null,null,null,null,null,null,null,null,null,null,null,null,null,null,null,null,null,null,null,0,0,0,0,0]
[37,{"$f":"CONCATENATE(FILIACION_ESTUDIANTE!B44,\"  \",FILIACION_ESTUDIANTE!C44,\"  \",FILIACION_ESTUDIANTE!D44)","v":"    "},null,null,null,null,null,null,null,null,null,null,null,null,null,null,null,null,null,null,null,null,null,null,null,null,null,null,0,0,0,0,0]
[38,{"$f":"CONCATENATE(FILIACION_ESTUDIANTE!B45,\"  \",FILIACION_ESTUDIANTE!C45,\"  \",FILIACION_ESTUDIANTE!D45)","v":"    "},null,null,null,null,null,null,null,null,null,null,null,null,null,null,null,null,null,null,null,null,null,null,null,null,null,null,0,0,0,0,0]
[39,{"$f":"CONCATENATE(FILIACION_ESTUDIANTE!B46,\"  \",FILIACION_ESTUDIANTE!C46,\"  \",FILIACION_ESTUDIANTE!D46)","v":"    "},null,null,null,null,null,null,null,null,null,null,null,null,null,null,null,null,null,null,null,null,null,null,null,null,null,null,0,0,0,0,0]
[40,{"$f":"CONCATENATE(FILIACION_ESTUDIANTE!B47,\"  \",FILIACION_ESTUDIANTE!C47,\"  \",FILIACION_ESTUDIANTE!D47)","v":"    "},null,null,null,null,null,null,null,null,null,null,null,null,null,null,null,null,null,null,null,null,null,null,null,null,null,null,0,0,0,0,0]
[null,null,null,null,null,null,null,null,null,null,null,null,null,null,null,null,null,null,null,null,null,null,null,null,"TOTAL",null,null,null,{"$f":"SUM(AC9:AC48)","v":0},{"$f":"SUM(AD9:AD48)","v":0},{"$f":"SUM(AE9:AF48)","v":0},null,{"$f":"SUM(AG9:AG48)","v":0}]
[null,null,null,null,null,null,null,null,null,null,null,null,null,null,null,null,null,null,null,null,null,null,null,null,null,null,null,null,null,null,null,null,null,null,null,{"$f":"(SUM(AF9:AF48,AC9:AD48)/#REF!)","v":{"$error":"#REF!"}},"SUMATORIA","DIAS TRAB","PROMEDIO"]
[]
[null,null,null,null,null,null,null,null,null,null,null,null,null,null,null,null,null,null,null,null,null,null,null,null,null,null,null,"%"]
[null,null,null,null,null,null,null,null,null,null,null,null,null,null,null,null,null,null,null,null,null,null,"LICENCIA",null,null,null,null,{"$f":"IFERROR(AC49/AG49,\"\")","v":""}]
[null,null,null,null,null,null,null,null,null,null,null,null,null,null,null,null,null,null,null,null,null,null,"FALTA",null,null,null,null,{"$f":"IFERROR(AD49/AG49,\"\")","v":""}]
[null,null,null,null,null,null,null,null,null,null,null,null,null,null,null,null,null,null,null,null,null,null,"PRESENTE",null,null,null,null,{"$f":"IFERROR(AE49/AG49,\"\")","v":""}]
[null,null,null,null,null,null,null,null,null,null,null,null,null,null,null,null,null,null,null,null,null,null,"TOTAL %",null,null,null,null,{"$f":"SUM(AB53:AD55)","v":0}]

{"sheet":"OCTUBRE","index":17,"n_rows":56,"n_cols":53,"rows_kept":56,"cut":false,"hidden":false,"merged":[[42,1,42,4],[43,1,43,4],[44,1,44,4],[37,1,37,4],[38,1,38,4],[39,1,39,4],[40,1,40,4],[41,1,41,4],[48,33,49,33],[49,8,49,10],[49,22,49,26],[49,27,49,29],[47,1,47,4],[26,37,26,39],[35,1,35,4],[27,1,27,4],[27,37,27,39],[28,1,28,4],[28,37,28,39],[29,1,29,4],[29,37,29,39],[30,1,30,4],[31,1,31,4],[32,1,32,4],[33,1,33,4],[34,1,34,4],[26,1,26,4],[23,37,23,39],[24,1,24,4],[24,37,24,39],[25,1,25,4],[25,37,25,39],[23,1,23,4],[21,37,21,39],[22,1,22,4],[22,37,22,39],[20,1,20,4],[20,37,20,39],[21,1,21,4],[16,37,18,39],[17,1,17,4],[18,1,18,4],[19,1,19,4],[6,31,7,31],[8,1,8,4],[8,33,47,33],[9,1,9,4],[10,1,10,4],[11,1,11,4],[12,1,12,4],[13,1,13,4],[14,1,14,4],[15,1,15,4],[16,1,16,4],[19,37,19,39],[0,33,0,34],[1,0,1,31],[2,0,2,31],[3,0,3,2],[3,3,3,12],[3,24,3,27],[3,28,3,31],[0,0,0,31],[5,0,5,31],[4,3,4,32],[48,24,48,27],[48,30,48,31],[51,22,51,26],[51,27,51,29],[6,0,7,0],[6,1,7,3],[6,28,7,28],[6,29,7,29],[6,30,7,30],[45,1,45,4],[46,1,46,4],[49,4,49,7],[6,32,7,32],[36,1,36,4],[55,22,55,26],[55,27,55,29],[52,22,52,26],[52,27,52,29],[53,22,53,26],[53,27,53,29],[54,22,54,26],[54,27,54,29]]}
[null,null,null,null,null,null,null,null,null,null,null,null,null,null,null,null,null,null,null,null,null,null,null,null,null,null,null,null,null,null,null,null,null,"ASISTENCIAS E INASISTENCIAS",null,"AZUL"]
[null,null,null,null,null,null,null,null,null,null,null,null,null,null,null,null,null,null,null,null,null,null,null,null,null,null,null,null,null,null,null,null,null,"Presente","P"]
[{"$f":"AL28","v":"REGISTRO DE ASISTENCIA OCTUBRE  2019"},null,null,null,null,null,null,null,null,null,null,null,null,null,null,null,null,null,null,null,null,null,null,null,null,null,null,null,null,null,null,null,null,"Atraso","A"]
[{"$f":"+UPPER(CARATULA!C20)","v":"MAESTRA (O):"},null,null,{"$f":"CARATULA!E20","v":0},null,null,null,null,null,null,null,null,null,null,null,null,null,null,null,null,null,null,null,null,"TURNO: ",null,null,null,{"$f":"CARATULA!E13","v":0},null,null,null,null,"falta con licencia","F"]
["PARALELO:",null,null,{"$f":"CARATULA!E14","v":0},null,null,null,null,null,null,null,null,null,null,null,null,null,null,null,null,null,null,null,null,null,null,null,null,null,null,null,null,null,"Falta sin licencia","L"]
[{"$f":"+CONCATENATE(\"AÑO DE ESCOLARIDAD:  \",CARATULA!E21)","v":"AÑO DE ESCOLARIDAD:  "}]
["Nº","NÓMINA",null,null,"DÍA","M","M","J","V","L","M","M","J","V","L","M","M","J","V","L","M","M","J","V","L","M","M","J","LICENCIA (L)","FALTA (F)","ATRASO (A)","PRESENTE (P)","DÍAS TRABAJADOS","dias materias tecnicas",0]
[null,null,null,null,"FECHA",1,{"$f":"F8+1","v":2},{"$f":"G8+1","v":3},{"$f":"H8+1","v":4},{"$f":"I8+3","v":7},{"$f":"J8+1","v":8},{"$f":"K8+1","v":9},{"$f":"L8+1","v":10},{"$f":"M8+1","v":11},{"$f":"N8+3","v":14},{"$f":"O8+1","v":15},{"$f":"P8+1","v":16},{"$f":"Q8+1","v":17},18,{"$f":"S8+3","v":21},22,23,24,25,{"$f":"X8+3","v":28},{"$f":"+Y8+1","v":29},{"$f":"+Z8+1","v":30},{"$f":"+AA8+1","v":31}]
[1,{"$f":"CONCATENATE(FILIACION_ESTUDIANTE!B8,\"  \",FILIACION_ESTUDIANTE!C8,\"  \",FILIACION_ESTUDIANTE!D8)","v":"    "},null,null,null,null,null,null,null,null,null,null,null,null,null,null,null,null,null,null,null,null,null,null,null,null,null,null,{"$f":"COUNTIF((F9:AB9),\"L\")","v":0},{"$f":"COUNTIF((F9:AB9),\"F\")","v":0},{"$f":"COUNTIF((F9:AB9),\"A\")","v":0},{"$f":"COUNTIF((F9:AB9),\"P\")","v":0},{"$f":"ROUND(SUM(AC9:AF9),)","v":0},"OCTUBRE"]
[2,{"$f":"CONCATENATE(FILIACION_ESTUDIANTE!B9,\"  \",FILIACION_ESTUDIANTE!C9,\"  \",FILIACION_ESTUDIANTE!D9)","v":"    "},null,null,null,null,null,null,null,null,null,null,null,null,null,null,null,null,null,null,null,null,null,null,null,null,null,null,{"$f":"COUNTIF((F10:AB10),\"L\")","v":0},{"$f":"COUNTIF((F10:AB10),\"F\")","v":0},{"$f":"COUNTIF((F10:AB10),\"A\")","v":0},{"$f":"COUNTIF((F10:AB10),\"P\")","v":0},0]
[3,{"$f":"CONCATENATE(FILIACION_ESTUDIANTE!B10,\"  \",FILIACION_ESTUDIANTE!C10,\"  \",FILIACION_ESTUDIANTE!D10)","v":"    "},null,null,null,null,null,null,null,null,null,null,null,null,null,null,null,null,null,null,null,null,null,null,null,null,null,null,0,0,0,0,0]
[4,{"$f":"CONCATENATE(FILIACION_ESTUDIANTE!B11,\"  \",FILIACION_ESTUDIANTE!C11,\"  \",FILIACION_ESTUDIANTE!D11)","v":"    "},null,null,null,null,null,null,null,null,null,null,null,null,null,null,null,null,null,null,null,null,null,null,null,null,null,null,0,0,0,0,0,null,null,null,null,null,null,null,null,null,null,null,null,null,null,null,null,null,null,{"$f":"ISLOGICAL((#REF!))","v":false},1]
[5,{"$f":"CONCATENATE(FILIACION_ESTUDIANTE!B12,\"  \",FILIACION_ESTUDIANTE!C12,\"  \",FILIACION_ESTUDIANTE!D12)","v":"    "},null,null,null,null,null,null,null,null,null,null,null,null,null,null,null,null,null,null,null,null,null,null,null,null,null,null,0,0,0,0,0,null,null,null,null,null,null,null,null,null,null,null,null,null,null,null,null,null,null,null,"A"]
[6,{"$f":"CONCATENATE(FILIACION_ESTUDIANTE!B13,\"  \",FILIACION_ESTUDIANTE!C13,\"  \",FILIACION_ESTUDIANTE!D13)","v":"    "},null,null,null,null,null,null,null,null,null,null,null,null,null,null,null,null,null,null,null,null,null,null,null,null,null,null,0,0,0,0,0,null,null,null,null,null,null,null,null,null,null,null,null,null,null,null,null,null,{"$f":"ISTEXT(#REF!)","v":false}]
[7,{"$f":"CONCATENATE(FILIACION_ESTUDIANTE!B14,\"  \",FILIACION_ESTUDIANTE!C14,\"  \",FILIACION_ESTUDIANTE!D14)","v":"    "},null,null,null,null,null,null,null,null,null,null,null,null,null,null,null,null,null,null,null,null,null,null,null,null,null,null,0,0,0,0,0,null,null,null,null,null,null,null,null,null,null,null,null,null,null,null,null,null,null,null,"a"]
[8,{"$f":"CONCATENATE(FILIACION_ESTUDIANTE!B15,\"  \",FILIACION_ESTUDIANTE!C15,\"  \",FILIACION_ESTUDIANTE!D15)","v":"    "},null,null,null,null,null,null,null,null,null,null,null,null,null,null,null,null,null,null,null,null,null,null,null,null,null,null,0,0,0,0,0,null,null,null,null,null,null,null,null,null,null,null,null,null,null,null,null,null,null,null,"a"]
[9,{"$f":"CONCATENATE(FILIACION_ESTUDIANTE!B16,\"  \",FILIACION_ESTUDIANTE!C16,\"  \",FILIACION_ESTUDIANTE!D16)","v":"    "},null,null,null,null,null,null,null,null,null,null,null,null,null,null,null,null,null,null,null,null,null,null,null,null,null,null,0,0,0,0,0,null,null,null,null,"ENCABEZADO DE LOS FORMULARIOS DE CONTROL DE ASISTENCIA",null,null,null,null,null,null,null,null,null,null,null,{"$f":"MONTH(AX18)","v":2},null,null,"f"]
[10,{"$f":"CONCATENATE(FILIACION_ESTUDIANTE!B17,\"  \",FILIACION_ESTUDIANTE!C17,\"  \",FILIACION_ESTUDIANTE!D17)","v":"    "},null,null,null,null,null,null,null,null,null,null,null,null,null,null,null,null,null,null,null,null,null,null,null,null,null,null,0,0,0,0,0,null,null,null,null,null,null,null,null,null,null,null,null,null,null,null,null,"2010-02-01",null,null,"f"]
[11,{"$f":"CONCATENATE(FILIACION_ESTUDIANTE!B18,\"  \",FILIACION_ESTUDIANTE!C18,\"  \",FILIACION_ESTUDIANTE!D18)","v":"    "},null,null,null,null,null,null,null,null,null,null,null,null,null,null,null,null,null,null,null,null,null,null,null,null,null,null,0,0,0,0,0,null,null,null,null,null,null,null,null,null,null,null,null,null,null,null,null,null,null,null,"f"]
[12,{"$f":"CONCATENATE(FILIACION_ESTUDIANTE!B19,\"  \",FILIACION_ESTUDIANTE!C19,\"  \",FILIACION_ESTUDIANTE!D19)","v":"    "},null,null,null,null,null,null,null,null,null,null,null,null,null,null,null,null,null,null,null,null,null,null,null,null,null,null,0,0,0,0,0,null,null,null,null,{"$f":"CONCATENATE(AO20,\" \",AP20)","v":"REGISTRO DE ASISTENCIA FEBRERO  2019"},null,null,"REGISTRO DE ASISTENCIA FEBRERO ",{"$f":"CARATULA!F26","v":2019},null,null,null,null,null,null,null,null,null,null,"p"]
[13,{"$f":"CONCATENATE(FILIACION_ESTUDIANTE!B20,\"  \",FILIACION_ESTUDIANTE!C20,\"  \",FILIACION_ESTUDIANTE!D20)","v":"    "},null,null,null,null,null,null,null,null,null,null,null,null,null,null,null,null,null,null,null,null,null,null,null,null,null,null,0,0,0,0,0,null,null,null,null,{"$f":"CONCATENATE(AO21,\" \",AP21)","v":"REGISTRO DE ASISTENCIA MARZO  2019"},null,null,"REGISTRO DE ASISTENCIA MARZO ",{"$f":"AP20","v":2019},null,null,null,null,null,null,null,null,null,null,"y"]
[14,{"$f":"CONCATENATE(FILIACION_ESTUDIANTE!B21,\"  \",FILIACION_ESTUDIANTE!C21,\"  \",FILIACION_ESTUDIANTE!D21)","v":"    "},null,null,null,null,null,null,null,null,null,null,null,null,null,null,null,null,null,null,null,null,null,null,null,null,null,null,0,0,0,0,0,null,null,null,null,"REGISTRO DE ASISTENCIA ABRIL  2019",null,null,"REGISTRO DE ASISTENCIA ABRIL ",{"$f":"AP21","v":2019},null,null,null,null,null,null,null,null,null,null,"a"]
[15,{"$f":"CONCATENATE(FILIACION_ESTUDIANTE!B22,\"  \",FILIACION_ESTUDIANTE!C22,\"  \",FILIACION_ESTUDIANTE!D22)","v":"    "},null,null,null,null,null,null,null,null,null,null,null,null,null,null,null,null,null,null,null,null,null,null,null,null,null,null,0,0,0,0,0,null,null,null,null,"REGISTRO DE ASISTENCIA MAYO  2019",null,null,"REGISTRO DE ASISTENCIA MAYO ",{"$f":"AP22","v":2019},null,null,null,null,null,null,null,null,null,null,"a"]
[16,{"$f":"CONCATENATE(FILIACION_ESTUDIANTE!B23,\"  \",FILIACION_ESTUDIANTE!C23,\"  \",FILIACION_ESTUDIANTE!D23)","v":"    "},null,null,null,null,null,null,null,null,null,null,null,null,null,null,null,null,null,null,null,null,null,null,null,null,null,null,0,0,0,0,0,null,null,null,null,"REGISTRO DE ASISTENCIA JUNIO  2019",null,null,"REGISTRO DE ASISTENCIA JUNIO ",2019,null,null,null,null,null,null,null,null,null,null,"a"]
[17,{"$f":"CONCATENATE(FILIACION_ESTUDIANTE!B24,\"  \",FILIACION_ESTUDIANTE!C24,\"  \",FILIACION_ESTUDIANTE!D24)","v":"    "},null,null,null,null,null,null,null,null,null,null,null,null,null,null,null,null,null,null,null,null,null,null,null,null,null,null,0,0,0,0,0,null,null,null,null,"REGISTRO DE ASISTENCIA JULIO  2019",null,null,"REGISTRO DE ASISTENCIA JULIO ",2019,null,null,null,null,null,null,null,null,null,null,"a"]
[18,{"$f":"CONCATENATE(FILIACION_ESTUDIANTE!B25,\"  \",FILIACION_ESTUDIANTE!C25,\"  \",FILIACION_ESTUDIANTE!D25)","v":"    "},null,null,null,null,null,null,null,null,null,null,null,null,null,null,null,null,null,null,null,null,null,null,null,null,null,null,0,0,0,0,0,null,null,null,null,"REGISTRO DE ASISTENCIA AGOSTO  2019",null,null,"REGISTRO DE ASISTENCIA AGOSTO ",2019,null,null,null,null,null,null,null,null,null,null,"a"]
[19,{"$f":"CONCATENATE(FILIACION_ESTUDIANTE!B26,\"  \",FILIACION_ESTUDIANTE!C26,\"  \",FILIACION_ESTUDIANTE!D26)","v":"    "},null,null,null,null,null,null,null,null,null,null,null,null,null,null,null,null,null,null,null,null,null,null,null,null,null,null,0,0,0,0,0,null,null,null,null,"REGISTRO DE ASISTENCIA SEPTIEMBRE  2019",null,null,"REGISTRO DE ASISTENCIA SEPTIEMBRE ",2019,null,null,null,null,null,null,null,null,null,null,"a"]
[20,{"$f":"CONCATENATE(FILIACION_ESTUDIANTE!B27,\"  \",FILIACION_ESTUDIANTE!C27,\"  \",FILIACION_ESTUDIANTE!D27)","v":"    "},null,null,null,null,null,null,null,null,null,null,null,null,null,null,null,null,null,null,null,null,null,null,null,null,null,null,0,0,0,0,0,null,null,null,null,"REGISTRO DE ASISTENCIA OCTUBRE  2019",null,null,"REGISTRO DE ASISTENCIA OCTUBRE ",2019,null,null,null,null,null,null,null,null,null,null,"f"]
[21,{"$f":"CONCATENATE(FILIACION_ESTUDIANTE!B28,\"  \",FILIACION_ESTUDIANTE!C28,\"  \",FILIACION_ESTUDIANTE!D28)","v":"    "},null,null,null,null,null,null,null,null,null,null,null,null,null,null,null,null,null,null,null,null,null,null,null,null,null,null,0,0,0,0,0,null,null,null,null,"REGISTRO DE ASISTENCIA NOVIEMBRE  2019",null,null,"REGISTRO DE ASISTENCIA NOVIEMBRE ",2019,null,null,null,null,null,null,null,null,null,null,"p"]
[22,{"$f":"CONCATENATE(FILIACION_ESTUDIANTE!B29,\"  \",FILIACION_ESTUDIANTE!C29,\"  \",FILIACION_ESTUDIANTE!D29)","v":"    "},null,null,null,null,null,null,null,null,null,null,null,null,null,null,null,null,null,null,null,null,null,null,null,null,null,null,0,0,0,0,0,null,null,null,null,"REGISTRO DE ASISTENCIA DICIEMBRE  2019",null,null,"REGISTRO DE ASISTENCIA DICIEMBRE ",2019,null,null,null,null,null,null,null,null,null,null,"M"]
[23,{"$f":"CONCATENATE(FILIACION_ESTUDIANTE!B30,\"  \",FILIACION_ESTUDIANTE!C30,\"  \",FILIACION_ESTUDIANTE!D30)","v":"    "},null,null,null,null,null,null,null,null,null,null,null,null,null,null,null,null,null,null,null,null,null,null,null,null,null,null,0,0,0,0,0]
[24,{"$f":"CONCATENATE(FILIACION_ESTUDIANTE!B31,\"  \",FILIACION_ESTUDIANTE!C31,\"  \",FILIACION_ESTUDIANTE!D31)","v":"    "},null,null,null,null,null,null,null,null,null,null,null,null,null,null,null,null,null,null,null,null,null,null,null,null,null,null,0,0,0,0,0,null,null,null,null,null,null,null,null,null,null,null,null,null,null,null,null,null,null,null,"M"]
[25,{"$f":"CONCATENATE(FILIACION_ESTUDIANTE!B32,\"  \",FILIACION_ESTUDIANTE!C32,\"  \",FILIACION_ESTUDIANTE!D32)","v":"    "},null,null,null,null,null,null,null,null,null,null,null,null,null,null,null,null,null,null,null,null,null,null,null,null,null,null,0,0,0,0,0,null,null,null,null,null,null,null,null,null,null,null,null,null,null,null,null,null,null,null,"M"]
[26,{"$f":"CONCATENATE(FILIACION_ESTUDIANTE!B33,\"  \",FILIACION_ESTUDIANTE!C33,\"  \",FILIACION_ESTUDIANTE!D33)","v":"    "},null,null,null,null,null,null,null,null,null,null,null,null,null,null,null,null,null,null,null,null,null,null,null,null,null,null,0,0,0,0,0,null,null,null,null,null,null,null,null,null,null,null,null,null,null,null,null,null,null,null,"M"]
[27,{"$f":"CONCATENATE(FILIACION_ESTUDIANTE!B34,\"  \",FILIACION_ESTUDIANTE!C34,\"  \",FILIACION_ESTUDIANTE!D34)","v":"    "},null,null,null,null,null,null,null,null,null,null,null,null,null,null,null,null,null,null,null,null,null,null,null,null,null,null,0,0,0,0,0,null,null,null,null,null,null,null,null,null,null,null,null,null,null,null,null,null,null,null,"M"]
[28,{"$f":"CONCATENATE(FILIACION_ESTUDIANTE!B35,\"  \",FILIACION_ESTUDIANTE!C35,\"  \",FILIACION_ESTUDIANTE!D35)","v":"    "},null,null,null,null,null,null,null,null,null,null,null,null,null,null,null,null,null,null,null,null,null,null,null,null,null,null,0,0,0,0,0,null,null,null,null,null,null,null,null,null,null,null,null,null,null,null,null,null,null,null,"M"]
[29,{"$f":"CONCATENATE(FILIACION_ESTUDIANTE!B36,\"  \",FILIACION_ESTUDIANTE!C36,\"  \",FILIACION_ESTUDIANTE!D36)","v":"    "},null,null,null,null,null,null,null,null,null,null,null,null,null,null,null,null,null,null,null,null,null,null,null,null,null,null,0,0,0,0,0]
[30,{"$f":"CONCATENATE(FILIACION_ESTUDIANTE!B37,\"  \",FILIACION_ESTUDIANTE!C37,\"  \",FILIACION_ESTUDIANTE!D37)","v":"    "},null,null,null,null,null,null,null,null,null,null,null,null,null,null,null,null,null,null,null,null,null,null,null,null,null,null,0,0,0,0,0]
[31,{"$f":"CONCATENATE(FILIACION_ESTUDIANTE!B38,\"  \",FILIACION_ESTUDIANTE!C38,\"  \",FILIACION_ESTUDIANTE!D38)","v":"    "},null,null,null,null,null,null,null,null,null,null,null,null,null,null,null,null,null,null,null,null,null,null,null,null,null,null,0,0,0,0,0,null,null,null,null,null,null,null,null,null,null,null,null,null,null,null,null,null,null,null,"M"]
[32,{"$f":"CONCATENATE(FILIACION_ESTUDIANTE!B39,\"  \",FILIACION_ESTUDIANTE!C39,\"  \",FILIACION_ESTUDIANTE!D39)","v":"    "},null,null,null,null,null,null,null,null,null,null,null,null,null,null,null,null,null,null,null,null,null,null,null,null,null,null,0,0,0,0,0,null,null,null,null,null,null,null,null,null,null,null,null,null,null,null,null,null,null,null,"M"]
[33,{"$f":"CONCATENATE(FILIACION_ESTUDIANTE!B40,\"  \",FILIACION_ESTUDIANTE!C40,\"  \",FILIACION_ESTUDIANTE!D40)","v":"    "},null,null,null,null,null,null,null,null,null,null,null,null,null,null,null,null,null,null,null,null,null,null,null,null,null,null,0,0,0,0,0]
[34,{"$f":"CONCATENATE(FILIACION_ESTUDIANTE!B41,\"  \",FILIACION_ESTUDIANTE!C41,\"  \",FILIACION_ESTUDIANTE!D41)","v":"    "},null,null,null,null,null,null,null,null,null,null,null,null,null,null,null,null,null,null,null,null,null,null,null,null,null,null,0,0,0,0,0]
[35,{"$f":"CONCATENATE(FILIACION_ESTUDIANTE!B42,\"  \",FILIACION_ESTUDIANTE!C42,\"  \",FILIACION_ESTUDIANTE!D42)","v":"    "},null,null,null,null,null,null,null,null,null,null,null,null,null,null,null,null,null,null,null,null,null,null,null,null,null,null,0,0,0,0,0]
[36,{"$f":"CONCATENATE(FILIACION_ESTUDIANTE!B43,\"  \",FILIACION_ESTUDIANTE!C43,\"  \",FILIACION_ESTUDIANTE!D43)","v":"    "},null,null,null,null,null,null,null,null,null,null,null,null,null,null,null,null,null,null,null,null,null,null,null,null,null,null,0,0,0,0,0]
[37,{"$f":"CONCATENATE(FILIACION_ESTUDIANTE!B44,\"  \",FILIACION_ESTUDIANTE!C44,\"  \",FILIACION_ESTUDIANTE!D44)","v":"    "},null,null,null,null,null,null,null,null,null,null,null,null,null,null,null,null,null,null,null,null,null,null,null,null,null,null,0,0,0,0,0]
[38,{"$f":"CONCATENATE(FILIACION_ESTUDIANTE!B45,\"  \",FILIACION_ESTUDIANTE!C45,\"  \",FILIACION_ESTUDIANTE!D45)","v":"    "},null,null,null,null,null,null,null,null,null,null,null,null,null,null,null,null,null,null,null,null,null,null,null,null,null,null,0,0,0,0,0]
[39,{"$f":"CONCATENATE(FILIACION_ESTUDIANTE!B46,\"  \",FILIACION_ESTUDIANTE!C46,\"  \",FILIACION_ESTUDIANTE!D46)","v":"    "},null,null,null,null,null,null,null,null,null,null,null,null,null,null,null,null,null,null,null,null,null,null,null,null,null,null,0,0,0,0,0]
[40,{"$f":"CONCATENATE(FILIACION_ESTUDIANTE!B47,\"  \",FILIACION_ESTUDIANTE!C47,\"  \",FILIACION_ESTUDIANTE!D47)","v":"    "},null,null,null,null,null,null,null,null,null,null,null,null,null,null,null,null,null,null,null,null,null,null,null,null,null,null,0,0,0,0,0]
[null,null,null,null,null,null,null,null,null,null,null,null,null,null,null,null,null,null,null,null,null,null,null,null,"TOTAL",null,null,null,{"$f":"SUM(AC9:AC48)","v":0},{"$f":"SUM(AD9:AD48)","v":0},{"$f":"SUM(AE9:AF48)","v":0},null,{"$f":"SUM(AG9:AG48)","v":0}]
[null,null,null,null,null,null,null,null,null,null,null,null,null,null,null,null,null,null,null,null,null,null,null,null,null,null,null,null,null,null,null,null,null,null,null,{"$f":"(SUM(AF9:AF48,AC9:AD48)/#REF!)","v":{"$error":"#REF!"}},"SUMATORIA","DIAS TRAB","PROMEDIO"]
[]
[null,null,null,null,null,null,null,null,null,null,null,null,null,null,null,null,null,null,null,null,null,null,null,null,null,null,null,"%"]
[null,null,null,null,null,null,null,null,null,null,null,null,null,null,null,null,null,null,null,null,null,null,"LICENCIA",null,null,null,null,{"$f":"IFERROR(AC49/AG49,\"\")","v":""}]
[null,null,null,null,null,null,null,null,null,null,null,null,null,null,null,null,null,null,null,null,null,null,"FALTA",null,null,null,null,{"$f":"IFERROR(AD49/AG49,\"\")","v":""}]
[null,null,null,null,null,null,null,null,null,null,null,null,null,null,null,null,null,null,null,null,null,null,"PRESENTE",null,null,null,null,{"$f":"IFERROR(AE49/AG49,\"\")","v":""}]
[null,null,null,null,null,null,null,null,null,null,null,null,null,null,null,null,null,null,null,null,null,null,"TOTAL %",null,null,null,null,{"$f":"SUM(AB53:AD55)","v":0}]

{"sheet":"NOVIEMBRE","index":18,"n_rows":55,"n_cols":53,"rows_kept":55,"cut":false,"hidden":false,"merged":[[42,1,42,4],[43,1,43,4],[44,1,44,4],[37,1,37,4],[38,1,38,4],[39,1,39,4],[40,1,40,4],[41,1,41,4],[48,33,49,33],[49,8,49,10],[49,22,49,26],[49,27,49,29],[47,1,47,4],[26,37,26,39],[35,1,35,4],[27,1,27,4],[27,37,27,39],[28,1,28,4],[28,37,28,39],[29,1,29,4],[29,37,29,39],[30,1,30,4],[31,1,31,4],[32,1,32,4],[33,1,33,4],[34,1,34,4],[26,1,26,4],[23,37,23,39],[24,1,24,4],[24,37,24,39],[25,1,25,4],[25,37,25,39],[23,1,23,4],[21,37,21,39],[22,1,22,4],[22,37,22,39],[20,1,20,4],[20,37,20,39],[21,1,21,4],[16,37,18,39],[17,1,17,4],[18,1,18,4],[19,1,19,4],[6,31,7,31],[8,1,8,4],[8,33,47,33],[9,1,9,4],[10,1,10,4],[11,1,11,4],[12,1,12,4],[13,1,13,4],[14,1,14,4],[15,1,15,4],[16,1,16,4],[19,37,19,39],[0,33,0,34],[1,0,1,31],[2,0,2,31],[3,0,3,2],[3,3,3,12],[3,24,3,27],[3,28,3,31],[0,0,0,31],[5,0,5,31],[4,3,4,32],[48,24,48,27],[48,30,48,31],[50,22,50,26],[50,27,50,29],[6,0,7,0],[6,1,7,3],[6,28,7,28],[6,29,7,29],[6,30,7,30],[45,1,45,4],[46,1,46,4],[49,4,49,7],[6,32,7,32],[36,1,36,4],[54,22,54,26],[54,27,54,29],[51,22,51,26],[51,27,51,29],[52,22,52,26],[52,27,52,29],[53,22,53,26],[53,27,53,29]]}
[null,null,null,null,null,null,null,null,null,null,null,null,null,null,null,null,null,null,null,null,null,null,null,null,null,null,null,null,null,null,null,null,null,"ASISTENCIAS E INASISTENCIAS",null,"AZUL"]
[null,null,null,null,null,null,null,null,null,null,null,null,null,null,null,null,null,null,null,null,null,null,null,null,null,null,null,null,null,null,null,null,null,"Presente","P"]
[{"$f":"AL29","v":"REGISTRO DE ASISTENCIA NOVIEMBRE  2019"},null,null,null,null,null,null,null,null,null,null,null,null,null,null,null,null,null,null,null,null,null,null,null,null,null,null,null,null,null,null,null,null,"Atraso","A"]
[{"$f":"+UPPER(CARATULA!C20)","v":"MAESTRA (O):"},null,null,{"$f":"CARATULA!E20","v":0},null,null,null,null,null,null,null,null,null,null,null,null,null,null,null,null,null,null,null,null,"TURNO: ",null,null,null,{"$f":"CARATULA!E13","v":0},null,null,null,null,"falta con licencia","F"]
["PARALELO:",null,null,{"$f":"CARATULA!E14","v":0},null,null,null,null,null,null,null,null,null,null,null,null,null,null,null,null,null,null,null,null,null,null,null,null,null,null,null,null,null,"Falta sin licencia","L"]
[{"$f":"+CONCATENATE(\"AÑO DE ESCOLARIDAD:  \",CARATULA!E21)","v":"AÑO DE ESCOLARIDAD:  "}]
["Nº","NÓMINA",null,null,"DÍA","V","L","M","M","J","V","L","M","M","J","V","L","M","M","J","V","L","M","M","J","V",null,null,"LICENCIA (L)","FALTA (F)","ATRASO (A)","PRESENTE (P)","DÍAS TRABAJADOS","dias materias tecnicas",0]
[null,null,null,null,"FECHA",1,{"$f":"F8+3","v":4},{"$f":"G8+1","v":5},6,7,8,{"$f":"K8+3","v":11},12,13,14,15,{"$f":"P8+3","v":18},19,20,21,22,{"$f":"U8+3","v":25},26,27,28,29]
[1,{"$f":"CONCATENATE(FILIACION_ESTUDIANTE!B8,\"  \",FILIACION_ESTUDIANTE!C8,\"  \",FILIACION_ESTUDIANTE!D8)","v":"    "},null,null,null,null,null,null,null,null,null,null,null,null,null,null,null,null,null,null,null,null,null,null,null,null,null,null,{"$f":"COUNTIF((F9:AB9),\"L\")","v":0},{"$f":"COUNTIF((F9:AB9),\"F\")","v":0},{"$f":"COUNTIF((F9:AB9),\"A\")","v":0},{"$f":"COUNTIF((F9:AB9),\"P\")","v":0},{"$f":"ROUND(SUM(AC9:AF9),)","v":0},"NOVIEMBRE"]
[2,{"$f":"CONCATENATE(FILIACION_ESTUDIANTE!B9,\"  \",FILIACION_ESTUDIANTE!C9,\"  \",FILIACION_ESTUDIANTE!D9)","v":"    "},null,null,null,null,null,null,null,null,null,null,null,null,null,null,null,null,null,null,null,null,null,null,null,null,null,null,{"$f":"COUNTIF((F10:AB10),\"L\")","v":0},{"$f":"COUNTIF((F10:AB10),\"F\")","v":0},{"$f":"COUNTIF((F10:AB10),\"A\")","v":0},{"$f":"COUNTIF((F10:AB10),\"P\")","v":0},0]
[3,{"$f":"CONCATENATE(FILIACION_ESTUDIANTE!B10,\"  \",FILIACION_ESTUDIANTE!C10,\"  \",FILIACION_ESTUDIANTE!D10)","v":"    "},null,null,null,null,null,null,null,null,null,null,null,null,null,null,null,null,null,null,null,null,null,null,null,null,null,null,0,0,0,0,0]
[4,{"$f":"CONCATENATE(FILIACION_ESTUDIANTE!B11,\"  \",FILIACION_ESTUDIANTE!C11,\"  \",FILIACION_ESTUDIANTE!D11)","v":"    "},null,null,null,null,null,null,null,null,null,null,null,null,null,null,null,null,null,null,null,null,null,null,null,null,null,null,0,0,0,0,0,null,null,null,null,null,null,null,null,null,null,null,null,null,null,null,null,null,null,{"$f":"ISLOGICAL((#REF!))","v":false},1]
[5,{"$f":"CONCATENATE(FILIACION_ESTUDIANTE!B12,\"  \",FILIACION_ESTUDIANTE!C12,\"  \",FILIACION_ESTUDIANTE!D12)","v":"    "},null,null,null,null,null,null,null,null,null,null,null,null,null,null,null,null,null,null,null,null,null,null,null,null,null,null,0,0,0,0,0,null,null,null,null,null,null,null,null,null,null,null,null,null,null,null,null,null,null,null,"A"]
[6,{"$f":"CONCATENATE(FILIACION_ESTUDIANTE!B13,\"  \",FILIACION_ESTUDIANTE!C13,\"  \",FILIACION_ESTUDIANTE!D13)","v":"    "},null,null,null,null,null,null,null,null,null,null,null,null,null,null,null,null,null,null,null,null,null,null,null,null,null,null,0,0,0,0,0,null,null,null,null,null,null,null,null,null,null,null,null,null,null,null,null,null,{"$f":"ISTEXT(#REF!)","v":false}]
[7,{"$f":"CONCATENATE(FILIACION_ESTUDIANTE!B14,\"  \",FILIACION_ESTUDIANTE!C14,\"  \",FILIACION_ESTUDIANTE!D14)","v":"    "},null,null,null,null,null,null,null,null,null,null,null,null,null,null,null,null,null,null,null,null,null,null,null,null,null,null,0,0,0,0,0,null,null,null,null,null,null,null,null,null,null,null,null,null,null,null,null,null,null,null,"a"]
[8,{"$f":"CONCATENATE(FILIACION_ESTUDIANTE!B15,\"  \",FILIACION_ESTUDIANTE!C15,\"  \",FILIACION_ESTUDIANTE!D15)","v":"    "},null,null,null,null,null,null,null,null,null,null,null,null,null,null,null,null,null,null,null,null,null,null,null,null,null,null,0,0,0,0,0,null,null,null,null,null,null,null,null,null,null,null,null,null,null,null,null,null,null,null,"a"]
[9,{"$f":"CONCATENATE(FILIACION_ESTUDIANTE!B16,\"  \",FILIACION_ESTUDIANTE!C16,\"  \",FILIACION_ESTUDIANTE!D16)","v":"    "},null,null,null,null,null,null,null,null,null,null,null,null,null,null,null,null,null,null,null,null,null,null,null,null,null,null,0,0,0,0,0,null,null,null,null,"ENCABEZADO DE LOS FORMULARIOS DE CONTROL DE ASISTENCIA",null,null,null,null,null,null,null,null,null,null,null,{"$f":"MONTH(AX18)","v":2},null,null,"f"]
[10,{"$f":"CONCATENATE(FILIACION_ESTUDIANTE!B17,\"  \",FILIACION_ESTUDIANTE!C17,\"  \",FILIACION_ESTUDIANTE!D17)","v":"    "},null,null,null,null,null,null,null,null,null,null,null,null,null,null,null,null,null,null,null,null,null,null,null,null,null,null,0,0,0,0,0,null,null,null,null,null,null,null,null,null,null,null,null,null,null,null,null,"2010-02-01",null,null,"f"]
[11,{"$f":"CONCATENATE(FILIACION_ESTUDIANTE!B18,\"  \",FILIACION_ESTUDIANTE!C18,\"  \",FILIACION_ESTUDIANTE!D18)","v":"    "},null,null,null,null,null,null,null,null,null,null,null,null,null,null,null,null,null,null,null,null,null,null,null,null,null,null,0,0,0,0,0,null,null,null,null,null,null,null,null,null,null,null,null,null,null,null,null,null,null,null,"f"]
[12,{"$f":"CONCATENATE(FILIACION_ESTUDIANTE!B19,\"  \",FILIACION_ESTUDIANTE!C19,\"  \",FILIACION_ESTUDIANTE!D19)","v":"    "},null,null,null,null,null,null,null,null,null,null,null,null,null,null,null,null,null,null,null,null,null,null,null,null,null,null,0,0,0,0,0,null,null,null,null,{"$f":"CONCATENATE(AO20,\" \",AP20)","v":"REGISTRO DE ASISTENCIA FEBRERO  2019"},null,null,"REGISTRO DE ASISTENCIA FEBRERO ",{"$f":"CARATULA!F26","v":2019},null,null,null,null,null,null,null,null,null,null,"p"]
[13,{"$f":"CONCATENATE(FILIACION_ESTUDIANTE!B20,\"  \",FILIACION_ESTUDIANTE!C20,\"  \",FILIACION_ESTUDIANTE!D20)","v":"    "},null,null,null,null,null,null,null,null,null,null,null,null,null,null,null,null,null,null,null,null,null,null,null,null,null,null,0,0,0,0,0,null,null,null,null,{"$f":"CONCATENATE(AO21,\" \",AP21)","v":"REGISTRO DE ASISTENCIA MARZO  2019"},null,null,"REGISTRO DE ASISTENCIA MARZO ",{"$f":"AP20","v":2019},null,null,null,null,null,null,null,null,null,null,"y"]
[14,{"$f":"CONCATENATE(FILIACION_ESTUDIANTE!B21,\"  \",FILIACION_ESTUDIANTE!C21,\"  \",FILIACION_ESTUDIANTE!D21)","v":"    "},null,null,null,null,null,null,null,null,null,null,null,null,null,null,null,null,null,null,null,null,null,null,null,null,null,null,0,0,0,0,0,null,null,null,null,"REGISTRO DE ASISTENCIA ABRIL  2019",null,null,"REGISTRO DE ASISTENCIA ABRIL ",{"$f":"AP21","v":2019},null,null,null,null,null,null,null,null,null,null,"a"]
[15,{"$f":"CONCATENATE(FILIACION_ESTUDIANTE!B22,\"  \",FILIACION_ESTUDIANTE!C22,\"  \",FILIACION_ESTUDIANTE!D22)","v":"    "},null,null,null,null,null,null,null,null,null,null,null,null,null,null,null,null,null,null,null,null,null,null,null,null,null,null,0,0,0,0,0,null,null,null,null,"REGISTRO DE ASISTENCIA MAYO  2019",null,null,"REGISTRO DE ASISTENCIA MAYO ",{"$f":"AP22","v":2019},null,null,null,null,null,null,null,null,null,null,"a"]
[16,{"$f":"CONCATENATE(FILIACION_ESTUDIANTE!B23,\"  \",FILIACION_ESTUDIANTE!C23,\"  \",FILIACION_ESTUDIANTE!D23)","v":"    "},null,null,null,null,null,null,null,null,null,null,null,null,null,null,null,null,null,null,null,null,null,null,null,null,null,null,0,0,0,0,0,null,null,null,null,"REGISTRO DE ASISTENCIA JUNIO  2019",null,null,"REGISTRO DE ASISTENCIA JUNIO ",2019,null,null,null,null,null,null,null,null,null,null,"a"]
[17,{"$f":"CONCATENATE(FILIACION_ESTUDIANTE!B24,\"  \",FILIACION_ESTUDIANTE!C24,\"  \",FILIACION_ESTUDIANTE!D24)","v":"    "},null,null,null,null,null,null,null,null,null,null,null,null,null,null,null,null,null,null,null,null,null,null,null,null,null,null,0,0,0,0,0,null,null,null,null,"REGISTRO DE ASISTENCIA JULIO  2019",null,null,"REGISTRO DE ASISTENCIA JULIO ",2019,null,null,null,null,null,null,null,null,null,null,"a"]
[18,{"$f":"CONCATENATE(FILIACION_ESTUDIANTE!B25,\"  \",FILIACION_ESTUDIANTE!C25,\"  \",FILIACION_ESTUDIANTE!D25)","v":"    "},null,null,null,null,null,null,null,null,null,null,null,null,null,null,null,null,null,null,null,null,null,null,null,null,null,null,0,0,0,0,0,null,null,null,null,"REGISTRO DE ASISTENCIA AGOSTO  2019",null,null,"REGISTRO DE ASISTENCIA AGOSTO ",2019,null,null,null,null,null,null,null,null,null,null,"a"]
[19,{"$f":"CONCATENATE(FILIACION_ESTUDIANTE!B26,\"  \",FILIACION_ESTUDIANTE!C26,\"  \",FILIACION_ESTUDIANTE!D26)","v":"    "},null,null,null,null,null,null,null,null,null,null,null,null,null,null,null,null,null,null,null,null,null,null,null,null,null,null,0,0,0,0,0,null,null,null,null,"REGISTRO DE ASISTENCIA SEPTIEMBRE  2019",null,null,"REGISTRO DE ASISTENCIA SEPTIEMBRE ",2019,null,null,null,null,null,null,null,null,null,null,"a"]
[20,{"$f":"CONCATENATE(FILIACION_ESTUDIANTE!B27,\"  \",FILIACION_ESTUDIANTE!C27,\"  \",FILIACION_ESTUDIANTE!D27)","v":"    "},null,null,null,null,null,null,null,null,null,null,null,null,null,null,null,null,null,null,null,null,null,null,null,null,null,null,0,0,0,0,0,null,null,null,null,"REGISTRO DE ASISTENCIA OCTUBRE  2019",null,null,"REGISTRO DE ASISTENCIA OCTUBRE ",2019,null,null,null,null,null,null,null,null,null,null,"f"]
[21,{"$f":"CONCATENATE(FILIACION_ESTUDIANTE!B28,\"  \",FILIACION_ESTUDIANTE!C28,\"  \",FILIACION_ESTUDIANTE!D28)","v":"    "},null,null,null,null,null,null,null,null,null,null,null,null,null,null,null,null,null,null,null,null,null,null,null,null,null,null,0,0,0,0,0,null,null,null,null,"REGISTRO DE ASISTENCIA NOVIEMBRE  2019",null,null,"REGISTRO DE ASISTENCIA NOVIEMBRE ",2019,null,null,null,null,null,null,null,null,null,null,"p"]
[22,{"$f":"CONCATENATE(FILIACION_ESTUDIANTE!B29,\"  \",FILIACION_ESTUDIANTE!C29,\"  \",FILIACION_ESTUDIANTE!D29)","v":"    "},null,null,null,null,null,null,null,null,null,null,null,null,null,null,null,null,null,null,null,null,null,null,null,null,null,null,0,0,0,0,0,null,null,null,null,"REGISTRO DE ASISTENCIA DICIEMBRE  2019",null,null,"REGISTRO DE ASISTENCIA DICIEMBRE ",2019,null,null,null,null,null,null,null,null,null,null,"M"]
[23,{"$f":"CONCATENATE(FILIACION_ESTUDIANTE!B30,\"  \",FILIACION_ESTUDIANTE!C30,\"  \",FILIACION_ESTUDIANTE!D30)","v":"    "},null,null,null,null,null,null,null,null,null,null,null,null,null,null,null,null,null,null,null,null,null,null,null,null,null,null,0,0,0,0,0]
[24,{"$f":"CONCATENATE(FILIACION_ESTUDIANTE!B31,\"  \",FILIACION_ESTUDIANTE!C31,\"  \",FILIACION_ESTUDIANTE!D31)","v":"    "},null,null,null,null,null,null,null,null,null,null,null,null,null,null,null,null,null,null,null,null,null,null,null,null,null,null,0,0,0,0,0,null,null,null,null,null,null,null,null,null,null,null,null,null,null,null,null,null,null,null,"M"]
[25,{"$f":"CONCATENATE(FILIACION_ESTUDIANTE!B32,\"  \",FILIACION_ESTUDIANTE!C32,\"  \",FILIACION_ESTUDIANTE!D32)","v":"    "},null,null,null,null,null,null,null,null,null,null,null,null,null,null,null,null,null,null,null,null,null,null,null,null,null,null,0,0,0,0,0,null,null,null,null,null,null,null,null,null,null,null,null,null,null,null,null,null,null,null,"M"]
[26,{"$f":"CONCATENATE(FILIACION_ESTUDIANTE!B33,\"  \",FILIACION_ESTUDIANTE!C33,\"  \",FILIACION_ESTUDIANTE!D33)","v":"    "},null,null,null,null,null,null,null,null,null,null,null,null,null,null,null,null,null,null,null,null,null,null,null,null,null,null,0,0,0,0,0,null,null,null,null,null,null,null,null,null,null,null,null,null,null,null,null,null,null,null,"M"]
[27,{"$f":"CONCATENATE(FILIACION_ESTUDIANTE!B34,\"  \",FILIACION_ESTUDIANTE!C34,\"  \",FILIACION_ESTUDIANTE!D34)","v":"    "},null,null,null,null,null,null,null,null,null,null,null,null,null,null,null,null,null,null,null,null,null,null,null,null,null,null,0,0,0,0,0,null,null,null,null,null,null,null,null,null,null,null,null,null,null,null,null,null,null,null,"M"]
[28,{"$f":"CONCATENATE(FILIACION_ESTUDIANTE!B35,\"  \",FILIACION_ESTUDIANTE!C35,\"  \",FILIACION_ESTUDIANTE!D35)","v":"    "},null,null,null,null,null,null,null,null,null,null,null,null,null,null,null,null,null,null,null,null,null,null,null,null,null,null,0,0,0,0,0,null,null,null,null,null,null,null,null,null,null,null,null,null,null,null,null,null,null,null,"M"]
[29,{"$f":"CONCATENATE(FILIACION_ESTUDIANTE!B36,\"  \",FILIACION_ESTUDIANTE!C36,\"  \",FILIACION_ESTUDIANTE!D36)","v":"    "},null,null,null,null,null,null,null,null,null,null,null,null,null,null,null,null,null,null,null,null,null,null,null,null,null,null,0,0,0,0,0]
[30,{"$f":"CONCATENATE(FILIACION_ESTUDIANTE!B37,\"  \",FILIACION_ESTUDIANTE!C37,\"  \",FILIACION_ESTUDIANTE!D37)","v":"    "},null,null,null,null,null,null,null,null,null,null,null,null,null,null,null,null,null,null,null,null,null,null,null,null,null,null,0,0,0,0,0]
[31,{"$f":"CONCATENATE(FILIACION_ESTUDIANTE!B38,\"  \",FILIACION_ESTUDIANTE!C38,\"  \",FILIACION_ESTUDIANTE!D38)","v":"    "},null,null,null,null,null,null,null,null,null,null,null,null,null,null,null,null,null,null,null,null,null,null,null,null,null,null,0,0,0,0,0,null,null,null,null,null,null,null,null,null,null,null,null,null,null,null,null,null,null,null,"M"]
[32,{"$f":"CONCATENATE(FILIACION_ESTUDIANTE!B39,\"  \",FILIACION_ESTUDIANTE!C39,\"  \",FILIACION_ESTUDIANTE!D39)","v":"    "},null,null,null,null,null,null,null,null,null,null,null,null,null,null,null,null,null,null,null,null,null,null,null,null,null,null,0,0,0,0,0,null,null,null,null,null,null,null,null,null,null,null,null,null,null,null,null,null,null,null,"M"]
[33,{"$f":"CONCATENATE(FILIACION_ESTUDIANTE!B40,\"  \",FILIACION_ESTUDIANTE!C40,\"  \",FILIACION_ESTUDIANTE!D40)","v":"    "},null,null,null,null,null,null,null,null,null,null,null,null,null,null,null,null,null,null,null,null,null,null,null,null,null,null,0,0,0,0,0]
[34,{"$f":"CONCATENATE(FILIACION_ESTUDIANTE!B41,\"  \",FILIACION_ESTUDIANTE!C41,\"  \",FILIACION_ESTUDIANTE!D41)","v":"    "},null,null,null,null,null,null,null,null,null,null,null,null,null,null,null,null,null,null,null,null,null,null,null,null,null,null,0,0,0,0,0]
[35,{"$f":"CONCATENATE(FILIACION_ESTUDIANTE!B42,\"  \",FILIACION_ESTUDIANTE!C42,\"  \",FILIACION_ESTUDIANTE!D42)","v":"    "},null,null,null,null,null,null,null,null,null,null,null,null,null,null,null,null,null,null,null,null,null,null,null,null,null,null,0,0,0,0,0]
[36,{"$f":"CONCATENATE(FILIACION_ESTUDIANTE!B43,\"  \",FILIACION_ESTUDIANTE!C43,\"  \",FILIACION_ESTUDIANTE!D43)","v":"    "},null,null,null,null,null,null,null,null,null,null,null,null,null,null,null,null,null,null,null,null,null,null,null,null,null,null,0,0,0,0,0]
[37,{"$f":"CONCATENATE(FILIACION_ESTUDIANTE!B44,\"  \",FILIACION_ESTUDIANTE!C44,\"  \",FILIACION_ESTUDIANTE!D44)","v":"    "},null,null,null,null,null,null,null,null,null,null,null,null,null,null,null,null,null,null,null,null,null,null,null,null,null,null,0,0,0,0,0]
[38,{"$f":"CONCATENATE(FILIACION_ESTUDIANTE!B45,\"  \",FILIACION_ESTUDIANTE!C45,\"  \",FILIACION_ESTUDIANTE!D45)","v":"    "},null,null,null,null,null,null,null,null,null,null,null,null,null,null,null,null,null,null,null,null,null,null,null,null,null,null,0,0,0,0,0]
[39,{"$f":"CONCATENATE(FILIACION_ESTUDIANTE!B46,\"  \",FILIACION_ESTUDIANTE!C46,\"  \",FILIACION_ESTUDIANTE!D46)","v":"    "},null,null,null,null,null,null,null,null,null,null,null,null,null,null,null,null,null,null,null,null,null,null,null,null,null,null,0,0,0,0,0]
[40,{"$f":"CONCATENATE(FILIACION_ESTUDIANTE!B47,\"  \",FILIACION_ESTUDIANTE!C47,\"  \",FILIACION_ESTUDIANTE!D47)","v":"    "},null,null,null,null,null,null,null,null,null,null,null,null,null,null,null,null,null,null,null,null,null,null,null,null,null,null,0,0,0,0,0]
[null,null,null,null,null,null,null,null,null,null,null,null,null,null,null,null,null,null,null,null,null,null,null,null,"TOTAL",null,null,null,{"$f":"SUM(AC9:AC48)","v":0},{"$f":"SUM(AD9:AD48)","v":0},{"$f":"SUM(AE9:AF48)","v":0},null,{"$f":"SUM(AG9:AG48)","v":0}]
[null,null,null,null,null,null,null,null,null,null,null,null,null,null,null,null,null,null,null,null,null,null,null,null,null,null,null,null,null,null,null,null,null,null,null,{"$f":"(SUM(AF9:AF48,AC9:AD48)/#REF!)","v":{"$error":"#REF!"}},"SUMATORIA","DIAS TRAB","PROMEDIO"]
[null,null,null,null,null,null,null,null,null,null,null,null,null,null,null,null,null,null,null,null,null,null,null,null,null,null,null,"%"]
[null,null,null,null,null,null,null,null,null,null,null,null,null,null,null,null,null,null,null,null,null,null,"LICENCIA",null,null,null,null,{"$f":"IFERROR(AC49/AG49,\"\")","v":""}]
[null,null,null,null,null,null,null,null,null,null,null,null,null,null,null,null,null,null,null,null,null,null,"FALTA",null,null,null,null,{"$f":"IFERROR(AD49/AG49,\"\")","v":""}]
[null,null,null,null,null,null,null,null,null,null,null,null,null,null,null,null,null,null,null,null,null,null,"PRESENTE",null,null,null,null,{"$f":"IFERROR(AE49/AG49,\"\")","v":""}]
[null,null,null,null,null,null,null,null,null,null,null,null,null,null,null,null,null,null,null,null,null,null,"TOTAL %",null,null,null,null,{"$f":"SUM(AB52:AD54)","v":0}]

{"sheet":"DICIEMBRE","index":19,"n_rows":55,"n_cols":53,"rows_kept":55,"cut":false,"hidden":false,"merged":[[42,1,42,4],[43,1,43,4],[44,1,44,4],[37,1,37,4],[38,1,38,4],[39,1,39,4],[40,1,40,4],[41,1,41,4],[48,33,49,33],[49,8,49,10],[49,22,49,26],[49,27,49,29],[47,1,47,4],[26,37,26,39],[35,1,35,4],[27,1,27,4],[27,37,27,39],[28,1,28,4],[28,37,28,39],[29,1,29,4],[29,37,29,39],[30,1,30,4],[31,1,31,4],[32,1,32,4],[33,1,33,4],[34,1,34,4],[26,1,26,4],[23,37,23,39],[24,1,24,4],[24,37,24,39],[25,1,25,4],[25,37,25,39],[23,1,23,4],[21,37,21,39],[22,1,22,4],[22,37,22,39],[20,1,20,4],[20,37,20,39],[21,1,21,4],[16,37,18,39],[17,1,17,4],[18,1,18,4],[19,1,19,4],[6,31,7,31],[8,1,8,4],[8,33,47,33],[9,1,9,4],[10,1,10,4],[11,1,11,4],[12,1,12,4],[13,1,13,4],[14,1,14,4],[15,1,15,4],[16,1,16,4],[19,37,19,39],[0,33,0,34],[1,0,1,31],[2,0,2,31],[3,0,3,2],[3,3,3,12],[3,24,3,27],[3,28,3,31],[0,0,0,31],[5,0,5,31],[4,3,4,32],[48,24,48,27],[48,30,48,31],[50,22,50,26],[50,27,50,29],[6,0,7,0],[6,1,7,3],[6,28,7,28],[6,29,7,29],[6,30,7,30],[45,1,45,4],[46,1,46,4],[49,4,49,7],[6,32,7,32],[36,1,36,4],[54,22,54,26],[54,27,54,29],[51,22,51,26],[51,27,51,29],[52,22,52,26],[52,27,52,29],[53,22,53,26],[53,27,53,29]]}
[null,null,null,null,null,null,null,null,null,null,null,null,null,null,null,null,null,null,null,null,null,null,null,null,null,null,null,null,null,null,null,null,null,"ASISTENCIAS E INASISTENCIAS",null,"AZUL"]
[null,null,null,null,null,null,null,null,null,null,null,null,null,null,null,null,null,null,null,null,null,null,null,null,null,null,null,null,null,null,null,null,null,"Presente","P"]
[{"$f":"AL30","v":"REGISTRO DE ASISTENCIA DICIEMBRE  2019"},null,null,null,null,null,null,null,null,null,null,null,null,null,null,null,null,null,null,null,null,null,null,null,null,null,null,null,null,null,null,null,null,"Atraso","A"]
[{"$f":"+UPPER(CARATULA!C20)","v":"MAESTRA (O):"},null,null,{"$f":"CARATULA!E20","v":0},null,null,null,null,null,null,null,null,null,null,null,null,null,null,null,null,null,null,null,null,"TURNO: ",null,null,null,{"$f":"CARATULA!E13","v":0},null,null,null,null,"falta con licencia","F"]
["PARALELO:",null,null,{"$f":"CARATULA!E14","v":0},null,null,null,null,null,null,null,null,null,null,null,null,null,null,null,null,null,null,null,null,null,null,null,null,null,null,null,null,null,"Falta sin licencia","L"]
[{"$f":"+CONCATENATE(\"AÑO DE ESCOLARIDAD:  \",CARATULA!E21)","v":"AÑO DE ESCOLARIDAD:  "}]
["Nº","NÓMINA",null,null,"DÍA","L","M","M","J","V","L","M","M","J","V","L","M","M","J","V","L",{"$f":"IF(F8=7,\"\",\"M\")","v":"M"},{"$f":"IF(V8>27,\"\",\"M\")","v":"M"},{"$f":"IF(W8>27,\"\",\"J\")","v":"J"},{"$f":"IF(X8>27,\"\",\"V\")","v":"V"},"L","M",null,"LICENCIA (L)","FALTA (F)","ATRASO (A)","PRESENTE (P)","DÍAS TRABAJADOS","dias materias tecnicas",0]
[null,null,null,null,"FECHA",2,{"$f":"F8+1","v":3},{"$f":"G8+1","v":4},{"$f":"H8+1","v":5},{"$f":"I8+1","v":6},{"$f":"J8+3","v":9},{"$f":"K8+1","v":10},{"$f":"L8+1","v":11},{"$f":"M8+1","v":12},{"$f":"N8+1","v":13},{"$f":"O8+3","v":16},{"$f":"P8+1","v":17},{"$f":"Q8+1","v":18},{"$f":"R8+1","v":19},20,{"$f":"T8+3","v":23},24,25,26,27,{"$f":"Y8+3","v":30},{"$f":"+Z8+1","v":31},{"$f":"IF($AH$9=\"FEBRERO\",\"\",AA8+1)","v":32}]
[1,{"$f":"CONCATENATE(FILIACION_ESTUDIANTE!B8,\"  \",FILIACION_ESTUDIANTE!C8,\"  \",FILIACION_ESTUDIANTE!D8)","v":"    "},null,null,null,null,null,null,null,null,null,null,null,null,null,null,null,null,null,null,null,null,null,null,null,null,null,null,{"$f":"COUNTIF((F9:AB9),\"L\")","v":0},{"$f":"COUNTIF((F9:AB9),\"F\")","v":0},{"$f":"COUNTIF((F9:AB9),\"A\")","v":0},{"$f":"COUNTIF((F9:AB9),\"P\")","v":0},{"$f":"ROUND(SUM(AC9:AF9),)","v":0},"DICEMBRE"]
[2,{"$f":"CONCATENATE(FILIACION_ESTUDIANTE!B9,\"  \",FILIACION_ESTUDIANTE!C9,\"  \",FILIACION_ESTUDIANTE!D9)","v":"    "},null,null,null,null,null,null,null,null,null,null,null,null,null,null,null,null,null,null,null,null,null,null,null,null,null,null,{"$f":"COUNTIF((F10:AB10),\"L\")","v":0},{"$f":"COUNTIF((F10:AB10),\"F\")","v":0},{"$f":"COUNTIF((F10:AB10),\"A\")","v":0},{"$f":"COUNTIF((F10:AB10),\"P\")","v":0},0]
[3,{"$f":"CONCATENATE(FILIACION_ESTUDIANTE!B10,\"  \",FILIACION_ESTUDIANTE!C10,\"  \",FILIACION_ESTUDIANTE!D10)","v":"    "},null,null,null,null,null,null,null,null,null,null,null,null,null,null,null,null,null,null,null,null,null,null,null,null,null,null,0,0,0,0,0]
[4,{"$f":"CONCATENATE(FILIACION_ESTUDIANTE!B11,\"  \",FILIACION_ESTUDIANTE!C11,\"  \",FILIACION_ESTUDIANTE!D11)","v":"    "},null,null,null,null,null,null,null,null,null,null,null,null,null,null,null,null,null,null,null,null,null,null,null,null,null,null,0,0,0,0,0,null,null,null,null,null,null,null,null,null,null,null,null,null,null,null,null,null,null,{"$f":"ISLOGICAL((#REF!))","v":false},1]
[5,{"$f":"CONCATENATE(FILIACION_ESTUDIANTE!B12,\"  \",FILIACION_ESTUDIANTE!C12,\"  \",FILIACION_ESTUDIANTE!D12)","v":"    "},null,null,null,null,null,null,null,null,null,null,null,null,null,null,null,null,null,null,null,null,null,null,null,null,null,null,0,0,0,0,0,null,null,null,null,null,null,null,null,null,null,null,null,null,null,null,null,null,null,null,"A"]
[6,{"$f":"CONCATENATE(FILIACION_ESTUDIANTE!B13,\"  \",FILIACION_ESTUDIANTE!C13,\"  \",FILIACION_ESTUDIANTE!D13)","v":"    "},null,null,null,null,null,null,null,null,null,null,null,null,null,null,null,null,null,null,null,null,null,null,null,null,null,null,0,0,0,0,0,null,null,null,null,null,null,null,null,null,null,null,null,null,null,null,null,null,{"$f":"ISTEXT(#REF!)","v":false}]
[7,{"$f":"CONCATENATE(FILIACION_ESTUDIANTE!B14,\"  \",FILIACION_ESTUDIANTE!C14,\"  \",FILIACION_ESTUDIANTE!D14)","v":"    "},null,null,null,null,null,null,null,null,null,null,null,null,null,null,null,null,null,null,null,null,null,null,null,null,null,null,0,0,0,0,0,null,null,null,null,null,null,null,null,null,null,null,null,null,null,null,null,null,null,null,"a"]
[8,{"$f":"CONCATENATE(FILIACION_ESTUDIANTE!B15,\"  \",FILIACION_ESTUDIANTE!C15,\"  \",FILIACION_ESTUDIANTE!D15)","v":"    "},null,null,null,null,null,null,null,null,null,null,null,null,null,null,null,null,null,null,null,null,null,null,null,null,null,null,0,0,0,0,0,null,null,null,null,null,null,null,null,null,null,null,null,null,null,null,null,null,null,null,"a"]
[9,{"$f":"CONCATENATE(FILIACION_ESTUDIANTE!B16,\"  \",FILIACION_ESTUDIANTE!C16,\"  \",FILIACION_ESTUDIANTE!D16)","v":"    "},null,null,null,null,null,null,null,null,null,null,null,null,null,null,null,null,null,null,null,null,null,null,null,null,null,null,0,0,0,0,0,null,null,null,null,"ENCABEZADO DE LOS FORMULARIOS DE CONTROL DE ASISTENCIA",null,null,null,null,null,null,null,null,null,null,null,{"$f":"MONTH(AX18)","v":2},null,null,"f"]
[10,{"$f":"CONCATENATE(FILIACION_ESTUDIANTE!B17,\"  \",FILIACION_ESTUDIANTE!C17,\"  \",FILIACION_ESTUDIANTE!D17)","v":"    "},null,null,null,null,null,null,null,null,null,null,null,null,null,null,null,null,null,null,null,null,null,null,null,null,null,null,0,0,0,0,0,null,null,null,null,null,null,null,null,null,null,null,null,null,null,null,null,"2010-02-01",null,null,"f"]
[11,{"$f":"CONCATENATE(FILIACION_ESTUDIANTE!B18,\"  \",FILIACION_ESTUDIANTE!C18,\"  \",FILIACION_ESTUDIANTE!D18)","v":"    "},null,null,null,null,null,null,null,null,null,null,null,null,null,null,null,null,null,null,null,null,null,null,null,null,null,null,0,0,0,0,0,null,null,null,null,null,null,null,null,null,null,null,null,null,null,null,null,null,null,null,"f"]
[12,{"$f":"CONCATENATE(FILIACION_ESTUDIANTE!B19,\"  \",FILIACION_ESTUDIANTE!C19,\"  \",FILIACION_ESTUDIANTE!D19)","v":"    "},null,null,null,null,null,null,null,null,null,null,null,null,null,null,null,null,null,null,null,null,null,null,null,null,null,null,0,0,0,0,0,null,null,null,null,{"$f":"CONCATENATE(AO20,\" \",AP20)","v":"REGISTRO DE ASISTENCIA FEBRERO  2019"},null,null,"REGISTRO DE ASISTENCIA FEBRERO ",{"$f":"CARATULA!F26","v":2019},null,null,null,null,null,null,null,null,null,null,"p"]
[13,{"$f":"CONCATENATE(FILIACION_ESTUDIANTE!B20,\"  \",FILIACION_ESTUDIANTE!C20,\"  \",FILIACION_ESTUDIANTE!D20)","v":"    "},null,null,null,null,null,null,null,null,null,null,null,null,null,null,null,null,null,null,null,null,null,null,null,null,null,null,0,0,0,0,0,null,null,null,null,{"$f":"CONCATENATE(AO21,\" \",AP21)","v":"REGISTRO DE ASISTENCIA MARZO  2019"},null,null,"REGISTRO DE ASISTENCIA MARZO ",{"$f":"AP20","v":2019},null,null,null,null,null,null,null,null,null,null,"y"]
[14,{"$f":"CONCATENATE(FILIACION_ESTUDIANTE!B21,\"  \",FILIACION_ESTUDIANTE!C21,\"  \",FILIACION_ESTUDIANTE!D21)","v":"    "},null,null,null,null,null,null,null,null,null,null,null,null,null,null,null,null,null,null,null,null,null,null,null,null,null,null,0,0,0,0,0,null,null,null,null,"REGISTRO DE ASISTENCIA ABRIL  2019",null,null,"REGISTRO DE ASISTENCIA ABRIL ",{"$f":"AP21","v":2019},null,null,null,null,null,null,null,null,null,null,"a"]
[15,{"$f":"CONCATENATE(FILIACION_ESTUDIANTE!B22,\"  \",FILIACION_ESTUDIANTE!C22,\"  \",FILIACION_ESTUDIANTE!D22)","v":"    "},null,null,null,null,null,null,null,null,null,null,null,null,null,null,null,null,null,null,null,null,null,null,null,null,null,null,0,0,0,0,0,null,null,null,null,"REGISTRO DE ASISTENCIA MAYO  2019",null,null,"REGISTRO DE ASISTENCIA MAYO ",{"$f":"AP22","v":2019},null,null,null,null,null,null,null,null,null,null,"a"]
[16,{"$f":"CONCATENATE(FILIACION_ESTUDIANTE!B23,\"  \",FILIACION_ESTUDIANTE!C23,\"  \",FILIACION_ESTUDIANTE!D23)","v":"    "},null,null,null,null,null,null,null,null,null,null,null,null,null,null,null,null,null,null,null,null,null,null,null,null,null,null,0,0,0,0,0,null,null,null,null,"REGISTRO DE ASISTENCIA JUNIO  2019",null,null,"REGISTRO DE ASISTENCIA JUNIO ",2019,null,null,null,null,null,null,null,null,null,null,"a"]
[17,{"$f":"CONCATENATE(FILIACION_ESTUDIANTE!B24,\"  \",FILIACION_ESTUDIANTE!C24,\"  \",FILIACION_ESTUDIANTE!D24)","v":"    "},null,null,null,null,null,null,null,null,null,null,null,null,null,null,null,null,null,null,null,null,null,null,null,null,null,null,0,0,0,0,0,null,null,null,null,"REGISTRO DE ASISTENCIA JULIO  2019",null,null,"REGISTRO DE ASISTENCIA JULIO ",2019,null,null,null,null,null,null,null,null,null,null,"a"]
[18,{"$f":"CONCATENATE(FILIACION_ESTUDIANTE!B25,\"  \",FILIACION_ESTUDIANTE!C25,\"  \",FILIACION_ESTUDIANTE!D25)","v":"    "},null,null,null,null,null,null,null,null,null,null,null,null,null,null,null,null,null,null,null,null,null,null,null,null,null,null,0,0,0,0,0,null,null,null,null,"REGISTRO DE ASISTENCIA AGOSTO  2019",null,null,"REGISTRO DE ASISTENCIA AGOSTO ",2019,null,null,null,null,null,null,null,null,null,null,"a"]
[19,{"$f":"CONCATENATE(FILIACION_ESTUDIANTE!B26,\"  \",FILIACION_ESTUDIANTE!C26,\"  \",FILIACION_ESTUDIANTE!D26)","v":"    "},null,null,null,null,null,null,null,null,null,null,null,null,null,null,null,null,null,null,null,null,null,null,null,null,null,null,0,0,0,0,0,null,null,null,null,"REGISTRO DE ASISTENCIA SEPTIEMBRE  2019",null,null,"REGISTRO DE ASISTENCIA SEPTIEMBRE ",2019,null,null,null,null,null,null,null,null,null,null,"a"]
[20,{"$f":"CONCATENATE(FILIACION_ESTUDIANTE!B27,\"  \",FILIACION_ESTUDIANTE!C27,\"  \",FILIACION_ESTUDIANTE!D27)","v":"    "},null,null,null,null,null,null,null,null,null,null,null,null,null,null,null,null,null,null,null,null,null,null,null,null,null,null,0,0,0,0,0,null,null,null,null,"REGISTRO DE ASISTENCIA OCTUBRE  2019",null,null,"REGISTRO DE ASISTENCIA OCTUBRE ",2019,null,null,null,null,null,null,null,null,null,null,"f"]
[21,{"$f":"CONCATENATE(FILIACION_ESTUDIANTE!B28,\"  \",FILIACION_ESTUDIANTE!C28,\"  \",FILIACION_ESTUDIANTE!D28)","v":"    "},null,null,null,null,null,null,null,null,null,null,null,null,null,null,null,null,null,null,null,null,null,null,null,null,null,null,0,0,0,0,0,null,null,null,null,"REGISTRO DE ASISTENCIA NOVIEMBRE  2019",null,null,"REGISTRO DE ASISTENCIA NOVIEMBRE ",2019,null,null,null,null,null,null,null,null,null,null,"p"]
[22,{"$f":"CONCATENATE(FILIACION_ESTUDIANTE!B29,\"  \",FILIACION_ESTUDIANTE!C29,\"  \",FILIACION_ESTUDIANTE!D29)","v":"    "},null,null,null,null,null,null,null,null,null,null,null,null,null,null,null,null,null,null,null,null,null,null,null,null,null,null,0,0,0,0,0,null,null,null,null,"REGISTRO DE ASISTENCIA DICIEMBRE  2019",null,null,"REGISTRO DE ASISTENCIA DICIEMBRE ",2019,null,null,null,null,null,null,null,null,null,null,"M"]
[23,{"$f":"CONCATENATE(FILIACION_ESTUDIANTE!B30,\"  \",FILIACION_ESTUDIANTE!C30,\"  \",FILIACION_ESTUDIANTE!D30)","v":"    "},null,null,null,null,null,null,null,null,null,null,null,null,null,null,null,null,null,null,null,null,null,null,null,null,null,null,0,0,0,0,0]
[24,{"$f":"CONCATENATE(FILIACION_ESTUDIANTE!B31,\"  \",FILIACION_ESTUDIANTE!C31,\"  \",FILIACION_ESTUDIANTE!D31)","v":"    "},null,null,null,null,null,null,null,null,null,null,null,null,null,null,null,null,null,null,null,null,null,null,null,null,null,null,0,0,0,0,0,null,null,null,null,null,null,null,null,null,null,null,null,null,null,null,null,null,null,null,"M"]
[25,{"$f":"CONCATENATE(FILIACION_ESTUDIANTE!B32,\"  \",FILIACION_ESTUDIANTE!C32,\"  \",FILIACION_ESTUDIANTE!D32)","v":"    "},null,null,null,null,null,null,null,null,null,null,null,null,null,null,null,null,null,null,null,null,null,null,null,null,null,null,0,0,0,0,0,null,null,null,null,null,null,null,null,null,null,null,null,null,null,null,null,null,null,null,"M"]
[26,{"$f":"CONCATENATE(FILIACION_ESTUDIANTE!B33,\"  \",FILIACION_ESTUDIANTE!C33,\"  \",FILIACION_ESTUDIANTE!D33)","v":"    "},null,null,null,null,null,null,null,null,null,null,null,null,null,null,null,null,null,null,null,null,null,null,null,null,null,null,0,0,0,0,0,null,null,null,null,null,null,null,null,null,null,null,null,null,null,null,null,null,null,null,"M"]
[27,{"$f":"CONCATENATE(FILIACION_ESTUDIANTE!B34,\"  \",FILIACION_ESTUDIANTE!C34,\"  \",FILIACION_ESTUDIANTE!D34)","v":"    "},null,null,null,null,null,null,null,null,null,null,null,null,null,null,null,null,null,null,null,null,null,null,null,null,null,null,0,0,0,0,0,null,null,null,null,null,null,null,null,null,null,null,null,null,null,null,null,null,null,null,"M"]
[28,{"$f":"CONCATENATE(FILIACION_ESTUDIANTE!B35,\"  \",FILIACION_ESTUDIANTE!C35,\"  \",FILIACION_ESTUDIANTE!D35)","v":"    "},null,null,null,null,null,null,null,null,null,null,null,null,null,null,null,null,null,null,null,null,null,null,null,null,null,null,0,0,0,0,0,null,null,null,null,null,null,null,null,null,null,null,null,null,null,null,null,null,null,null,"M"]
[29,{"$f":"CONCATENATE(FILIACION_ESTUDIANTE!B36,\"  \",FILIACION_ESTUDIANTE!C36,\"  \",FILIACION_ESTUDIANTE!D36)","v":"    "},null,null,null,null,null,null,null,null,null,null,null,null,null,null,null,null,null,null,null,null,null,null,null,null,null,null,0,0,0,0,0]
[30,{"$f":"CONCATENATE(FILIACION_ESTUDIANTE!B37,\"  \",FILIACION_ESTUDIANTE!C37,\"  \",FILIACION_ESTUDIANTE!D37)","v":"    "},null,null,null,null,null,null,null,null,null,null,null,null,null,null,null,null,null,null,null,null,null,null,null,null,null,null,0,0,0,0,0]
[31,{"$f":"CONCATENATE(FILIACION_ESTUDIANTE!B38,\"  \",FILIACION_ESTUDIANTE!C38,\"  \",FILIACION_ESTUDIANTE!D38)","v":"    "},null,null,null,null,null,null,null,null,null,null,null,null,null,null,null,null,null,null,null,null,null,null,null,null,null,null,0,0,0,0,0,null,null,null,null,null,null,null,null,null,null,null,null,null,null,null,null,null,null,null,"M"]
[32,{"$f":"CONCATENATE(FILIACION_ESTUDIANTE!B39,\"  \",FILIACION_ESTUDIANTE!C39,\"  \",FILIACION_ESTUDIANTE!D39)","v":"    "},null,null,null,null,null,null,null,null,null,null,null,null,null,null,null,null,null,null,null,null,null,null,null,null,null,null,0,0,0,0,0,null,null,null,null,null,null,null,null,null,null,null,null,null,null,null,null,null,null,null,"M"]
[33,{"$f":"CONCATENATE(FILIACION_ESTUDIANTE!B40,\"  \",FILIACION_ESTUDIANTE!C40,\"  \",FILIACION_ESTUDIANTE!D40)","v":"    "},null,null,null,null,null,null,null,null,null,null,null,null,null,null,null,null,null,null,null,null,null,null,null,null,null,null,0,0,0,0,0]
[34,{"$f":"CONCATENATE(FILIACION_ESTUDIANTE!B41,\"  \",FILIACION_ESTUDIANTE!C41,\"  \",FILIACION_ESTUDIANTE!D41)","v":"    "},null,null,null,null,null,null,null,null,null,null,null,null,null,null,null,null,null,null,null,null,null,null,null,null,null,null,0,0,0,0,0]
[35,{"$f":"CONCATENATE(FILIACION_ESTUDIANTE!B42,\"  \",FILIACION_ESTUDIANTE!C42,\"  \",FILIACION_ESTUDIANTE!D42)","v":"    "},null,null,null,null,null,null,null,null,null,null,null,null,null,null,null,null,null,null,null,null,null,null,null,null,null,null,0,0,0,0,0]
[36,{"$f":"CONCATENATE(FILIACION_ESTUDIANTE!B43,\"  \",FILIACION_ESTUDIANTE!C43,\"  \",FILIACION_ESTUDIANTE!D43)","v":"    "},null,null,null,null,null,null,null,null,null,null,null,null,null,null,null,null,null,null,null,null,null,null,null,null,null,null,0,0,0,0,0]
[37,{"$f":"CONCATENATE(FILIACION_ESTUDIANTE!B44,\"  \",FILIACION_ESTUDIANTE!C44,\"  \",FILIACION_ESTUDIANTE!D44)","v":"    "},null,null,null,null,null,null,null,null,null,null,null,null,null,null,null,null,null,null,null,null,null,null,null,null,null,null,0,0,0,0,0]
[38,{"$f":"CONCATENATE(FILIACION_ESTUDIANTE!B45,\"  \",FILIACION_ESTUDIANTE!C45,\"  \",FILIACION_ESTUDIANTE!D45)","v":"    "},null,null,null,null,null,null,null,null,null,null,null,null,null,null,null,null,null,null,null,null,null,null,null,null,null,null,0,0,0,0,0]
[39,{"$f":"CONCATENATE(FILIACION_ESTUDIANTE!B46,\"  \",FILIACION_ESTUDIANTE!C46,\"  \",FILIACION_ESTUDIANTE!D46)","v":"    "},null,null,null,null,null,null,null,null,null,null,null,null,null,null,null,null,null,null,null,null,null,null,null,null,null,null,0,0,0,0,0]
[40,{"$f":"CONCATENATE(FILIACION_ESTUDIANTE!B47,\"  \",FILIACION_ESTUDIANTE!C47,\"  \",FILIACION_ESTUDIANTE!D47)","v":"    "},null,null,null,null,null,null,null,null,null,null,null,null,null,null,null,null,null,null,null,null,null,null,null,null,null,null,0,0,0,0,0]
[null,null,null,null,null,null,null,null,null,null,null,null,null,null,null,null,null,null,null,null,null,null,null,null,"TOTAL",null,null,null,{"$f":"SUM(AC9:AC48)","v":0},{"$f":"SUM(AD9:AD48)","v":0},{"$f":"SUM(AE9:AF48)","v":0},null,{"$f":"SUM(AG9:AG48)","v":0},{"$f":"IF(AJ50=0,\"Asistencia Vacia contactese con eliascarloshidalgo@gmail.com O LLAME AL 74094003\",IF(#REF!=#REF!,\"Impresión Asistencia  correcta \",\"CUIDADO LOS RESULTADOS NO SON LOS CORRECTOS\"))","v":{"$error":"#REF!"}}]
[null,null,null,null,null,null,null,null,null,null,null,null,null,null,null,null,null,null,null,null,null,null,null,null,null,null,null,null,null,null,null,null,null,null,null,{"$f":"(SUM(AF9:AF48,AC9:AD48)/#REF!)","v":{"$error":"#REF!"}},"SUMATORIA","DIAS TRAB","PROMEDIO"]
[null,null,null,null,null,null,null,null,null,null,null,null,null,null,null,null,null,null,null,null,null,null,null,null,null,null,null,"%"]
[null,null,null,null,null,null,null,null,null,null,null,null,null,null,null,null,null,null,null,null,null,null,"LICENCIA",null,null,null,null,{"$f":"IFERROR(AC49/AG49,\"\")","v":""}]
[null,null,null,null,null,null,null,null,null,null,null,null,null,null,null,null,null,null,null,null,null,null,"FALTA",null,null,null,null,{"$f":"IFERROR(AD49/AG49,\"\")","v":""}]
[null,null,null,null,null,null,null,null,null,null,null,null,null,null,null,null,null,null,null,null,null,null,"PRESENTE",null,null,null,null,{"$f":"IFERROR(AE49/AG49,\"\")","v":""}]
[null,null,null,null,null,null,null,null,null,null,null,null,null,null,null,null,null,null,null,null,null,null,"TOTAL %",null,null,null,null,{"$f":"SUM(AB52:AD54)","v":0}]

{"sheet":"VALORACION POR CAMPOS","index":20,"n_rows":0,"n_cols":0,"rows_kept":0,"cut":false,"hidden":false,"merged":[[0,0,0,7]]}

{"sheet":"COM_SOC_1B","index":21,"n_rows":53,"n_cols":48,"rows_kept":53,"cut":false,"hidden":false,"merged":[[43,18,43,19],[44,18,44,19],[45,18,45,19],[51,18,51,19],[52,18,52,19],[46,18,46,19],[47,18,47,19],[48,18,48,19],[49,18,49,19],[50,18,50,19],[38,18,38,19],[39,18,39,19],[40,18,40,19],[41,18,41,19],[42,18,42,19],[33,18,33,19],[34,18,34,19],[35,18,35,19],[36,18,36,19],[37,18,37,19],[28,18,28,19],[29,18,29,19],[30,18,30,19],[31,18,31,19],[32,18,32,19],[23,18,23,19],[24,18,24,19],[25,18,25,19],[26,18,26,19],[27,18,27,19],[18,18,18,19],[19,18,19,19],[20,18,20,19],[21,18,21,19],[22,18,22,19],[13,18,13,19],[14,18,14,19],[15,18,15,19],[16,18,16,19],[17,18,17,19],[1,1,2,1],[1,2,1,19],[1,27,6,31],[3,0,3,1],[3,2,3,11],[4,0,4,20],[5,0,5,1],[5,2,5,20],[6,2,6,5],[6,6,6,9],[6,10,6,13],[6,14,6,17],[2,2,2,19],[7,10,9,10],[7,11,9,11],[7,12,9,12],[7,13,9,13],[6,18,8,19],[7,1,9,1],[7,7,9,7],[7,8,9,8],[6,0,12,0],[7,9,9,9],[7,2,9,2],[7,3,9,3],[7,4,9,4],[7,5,9,5],[7,6,9,6],[11,2,12,2],[11,3,12,3],[11,4,12,4],[11,5,12,5],[11,6,12,6],[11,7,12,7],[11,15,12,15],[11,16,12,16],[3,12,3,17],[3,18,3,20],[6,20,12,20],[7,14,9,14],[7,15,9,15],[7,16,9,16],[7,17,9,17],[11,17,12,17],[11,18,12,19],[10,18,10,19],[11,13,12,13],[11,14,12,14],[11,8,12,8],[11,9,12,9],[11,10,12,10],[11,11,12,11],[11,12,12,12]]}
[]
[null,null,"CUADRO DE VALORACIÓN",null,null,null,null,null,null,null,null,null,null,null,null,null,null,null,null,null,null,null,null,null,null,null,null,"REGISTRO DE VALORACION",null,null,null,null,"ED",null,null,null,null,null,null,null,"DA","DO",null,"DP"]
[null,null,"EDUCACIÓN INICIAL  EN FAMILIA COMUNITARIA ",null,null,null,null,null,null,null,null,null,null,null,null,null,null,null,null,null,"1er BIMESTRE"]
[{"$f":"UPPER( CARATULA!$C$20)","v":"MAESTRA (O):"},null,{"$f":"CARATULA!$E$20","v":0},null,null,null,null,null,null,null,null,null,{"$f":"UPPER(CARATULA!$C$21)","v":"AÑO DE ESCOLARIDAD:"},null,null,null,null,null,{"$f":"CARATULA!$E$21","v":0}]
["CAMPO DE SABER Y CONOCIMIENTO COMUNIDAD Y SOCIEDAD"]
["EVALUACIÓN",null,"CRITERIOS DE LAS DIMENSIONES"]
["Nº","DIMENSIONES","SER",null,null,null,"SABER",null,null,null,"HACER",null,null,null,"DECIDIR",null,null,null,"AUTOEVALUACIÓN (SER, SABER, HACER, DECIDIR)",null,"SÍNTESIS CUALITATIVA DEL BIMESTRE"]
[null,"PLANES DE CLASE (PDC)","PDC","PDC","PDC","PDC","PDC","PDC","PDC","PDC","PDC","PDC","PDC","PDC","PDC","PDC","PDC","PDC"]
[null,null,null,null,null,null,null,null,null,null,null,null,null,null,null,null,null,null,null,null,null,null,null,null,null,null,null,"DP","DO","DA","ED"]
[null,null,null,null,null,null,null,null,null,null,null,null,null,null,null,null,null,null,null,null,null,null,null,null,null,null,null,14,8,5,1]
[null,"CRITERIOS DE EVALUACIÓN"]
[null,"INSTRUMENTOS Y/O ESTRATEGIAS DE EVALUACIÓN"]
[null,"APELLIDOS Y NOMBRES"]
[1,{"$f":"CONCATENATE(FILIACION_ESTUDIANTE!B8,\"  \",FILIACION_ESTUDIANTE!C8,\"  \",FILIACION_ESTUDIANTE!D8)","v":"    "},null,null,null,null,null,null,null,null,null,null,null,null,null,null,null,null,null,null,null,null,null,"demuestra  algunas actitudes armonicas etre sfamilia Y  LE FALTAT",null,null,null,{"$f":"IF(C14=$AB$9,$AB$10,IF(C14=$AC$9,$AC$10,IF(C14=$AD$9,$AD$10,IF(C14=$AE$9,$AE$10))))","v":false},{"$f":"IF(D14=$AB$9,$AB$10,IF(D14=$AC$9,$AC$10,IF(D14=$AD$9,$AD$10,IF(D14=$AE$9,$AE$10))))","v":false},{"$f":"IF(E14=$AB$9,$AB$10,IF(E14=$AC$9,$AC$10,IF(E14=$AD$9,$AD$10,IF(E14=$AE$9,$AE$10))))","v":false},{"$f":"IF(F14=$AB$9,$AB$10,IF(F14=$AC$9,$AC$10,IF(F14=$AD$9,$AD$10,IF(F14=$AE$9,$AE$10))))","v":false},{"$f":"SUM(AB14:AE14)","v":0},{"$f":"IF(G14=$AB$9,$AB$10,IF(G14=$AC$9,$AC$10,IF(G14=$AD$9,$AD$10,IF(G14=$AE$9,$AE$10))))","v":false},{"$f":"IF(H14=$AB$9,$AB$10,IF(H14=$AC$9,$AC$10,IF(H14=$AD$9,$AD$10,IF(H14=$AE$9,$AE$10))))","v":false},{"$f":"IF(I14=$AB$9,$AB$10,IF(I14=$AC$9,$AC$10,IF(I14=$AD$9,$AD$10,IF(I14=$AE$9,$AE$10))))","v":false},{"$f":"IF(J14=$AB$9,$AB$10,IF(J14=$AC$9,$AC$10,IF(J14=$AD$9,$AD$10,IF(J14=$AE$9,$AE$10))))","v":false},{"$f":"SUM(AG14:AJ14)","v":0},{"$f":"IF(K14=$AB$9,$AB$10,IF(K14=$AC$9,$AC$10,IF(K14=$AD$9,$AD$10,IF(K14=$AE$9,$AE$10))))","v":false},{"$f":"IF(L14=$AB$9,$AB$10,IF(L14=$AC$9,$AC$10,IF(L14=$AD$9,$AD$10,IF(L14=$AE$9,$AE$10))))","v":false},{"$f":"IF(M14=$AB$9,$AB$10,IF(M14=$AC$9,$AC$10,IF(M14=$AD$9,$AD$10,IF(M14=$AE$9,$AE$10))))","v":false},{"$f":"IF(N14=$AB$9,$AB$10,IF(N14=$AC$9,$AC$10,IF(N14=$AD$9,$AD$10,IF(N14=$AE$9,$AE$10))))","v":false},{"$f":"SUM(AL14:AO14)","v":0},{"$f":"IF(O14=$AB$9,$AB$10,IF(O14=$AC$9,$AC$10,IF(O14=$AD$9,$AD$10,IF(O14=$AE$9,$AE$10))))","v":false},{"$f":"IF(P14=$AB$9,$AB$10,IF(P14=$AC$9,$AC$10,IF(P14=$AD$9,$AD$10,IF(P14=$AE$9,$AE$10))))","v":false},{"$f":"IF(Q14=$AB$9,$AB$10,IF(Q14=$AC$9,$AC$10,IF(Q14=$AD$9,$AD$10,IF(Q14=$AE$9,$AE$10))))","v":false},{"$f":"IF(R14=$AB$9,$AB$10,IF(R14=$AC$9,$AC$10,IF(R14=$AD$9,$AD$10,IF(R14=$AE$9,$AE$10))))","v":false},{"$f":"SUM(AQ14:AT14)","v":0},{"$f":"MAX(AF14,AK14,AP14,AU14)","v":0}]
[2,{"$f":"CONCATENATE(FILIACION_ESTUDIANTE!B9,\"  \",FILIACION_ESTUDIANTE!C9,\"  \",FILIACION_ESTUDIANTE!D9)","v":"    "}]
[3,{"$f":"CONCATENATE(FILIACION_ESTUDIANTE!B10,\"  \",FILIACION_ESTUDIANTE!C10,\"  \",FILIACION_ESTUDIANTE!D10)","v":"    "}]
[4,{"$f":"CONCATENATE(FILIACION_ESTUDIANTE!B11,\"  \",FILIACION_ESTUDIANTE!C11,\"  \",FILIACION_ESTUDIANTE!D11)","v":"    "}]
[5,{"$f":"CONCATENATE(FILIACION_ESTUDIANTE!B12,\"  \",FILIACION_ESTUDIANTE!C12,\"  \",FILIACION_ESTUDIANTE!D12)","v":"    "}]
[6,{"$f":"CONCATENATE(FILIACION_ESTUDIANTE!B13,\"  \",FILIACION_ESTUDIANTE!C13,\"  \",FILIACION_ESTUDIANTE!D13)","v":"    "}]
[7,{"$f":"CONCATENATE(FILIACION_ESTUDIANTE!B14,\"  \",FILIACION_ESTUDIANTE!C14,\"  \",FILIACION_ESTUDIANTE!D14)","v":"    "}]
[8,{"$f":"CONCATENATE(FILIACION_ESTUDIANTE!B15,\"  \",FILIACION_ESTUDIANTE!C15,\"  \",FILIACION_ESTUDIANTE!D15)","v":"    "}]
[9,{"$f":"CONCATENATE(FILIACION_ESTUDIANTE!B16,\"  \",FILIACION_ESTUDIANTE!C16,\"  \",FILIACION_ESTUDIANTE!D16)","v":"    "}]
[10,{"$f":"CONCATENATE(FILIACION_ESTUDIANTE!B17,\"  \",FILIACION_ESTUDIANTE!C17,\"  \",FILIACION_ESTUDIANTE!D17)","v":"    "}]
[11,{"$f":"CONCATENATE(FILIACION_ESTUDIANTE!B18,\"  \",FILIACION_ESTUDIANTE!C18,\"  \",FILIACION_ESTUDIANTE!D18)","v":"    "}]
[12,{"$f":"CONCATENATE(FILIACION_ESTUDIANTE!B19,\"  \",FILIACION_ESTUDIANTE!C19,\"  \",FILIACION_ESTUDIANTE!D19)","v":"    "}]
[13,{"$f":"CONCATENATE(FILIACION_ESTUDIANTE!B20,\"  \",FILIACION_ESTUDIANTE!C20,\"  \",FILIACION_ESTUDIANTE!D20)","v":"    "}]
[14,{"$f":"CONCATENATE(FILIACION_ESTUDIANTE!B21,\"  \",FILIACION_ESTUDIANTE!C21,\"  \",FILIACION_ESTUDIANTE!D21)","v":"    "}]
[15,{"$f":"CONCATENATE(FILIACION_ESTUDIANTE!B22,\"  \",FILIACION_ESTUDIANTE!C22,\"  \",FILIACION_ESTUDIANTE!D22)","v":"    "}]
[16,{"$f":"CONCATENATE(FILIACION_ESTUDIANTE!B23,\"  \",FILIACION_ESTUDIANTE!C23,\"  \",FILIACION_ESTUDIANTE!D23)","v":"    "}]
[17,{"$f":"CONCATENATE(FILIACION_ESTUDIANTE!B24,\"  \",FILIACION_ESTUDIANTE!C24,\"  \",FILIACION_ESTUDIANTE!D24)","v":"    "}]
[18,{"$f":"CONCATENATE(FILIACION_ESTUDIANTE!B25,\"  \",FILIACION_ESTUDIANTE!C25,\"  \",FILIACION_ESTUDIANTE!D25)","v":"    "}]
[19,{"$f":"CONCATENATE(FILIACION_ESTUDIANTE!B26,\"  \",FILIACION_ESTUDIANTE!C26,\"  \",FILIACION_ESTUDIANTE!D26)","v":"    "}]
[20,{"$f":"CONCATENATE(FILIACION_ESTUDIANTE!B27,\"  \",FILIACION_ESTUDIANTE!C27,\"  \",FILIACION_ESTUDIANTE!D27)","v":"    "}]
[21,{"$f":"CONCATENATE(FILIACION_ESTUDIANTE!B28,\"  \",FILIACION_ESTUDIANTE!C28,\"  \",FILIACION_ESTUDIANTE!D28)","v":"    "}]
[22,{"$f":"CONCATENATE(FILIACION_ESTUDIANTE!B29,\"  \",FILIACION_ESTUDIANTE!C29,\"  \",FILIACION_ESTUDIANTE!D29)","v":"    "}]
[23,{"$f":"CONCATENATE(FILIACION_ESTUDIANTE!B30,\"  \",FILIACION_ESTUDIANTE!C30,\"  \",FILIACION_ESTUDIANTE!D30)","v":"    "}]
[24,{"$f":"CONCATENATE(FILIACION_ESTUDIANTE!B31,\"  \",FILIACION_ESTUDIANTE!C31,\"  \",FILIACION_ESTUDIANTE!D31)","v":"    "}]
[25,{"$f":"CONCATENATE(FILIACION_ESTUDIANTE!B32,\"  \",FILIACION_ESTUDIANTE!C32,\"  \",FILIACION_ESTUDIANTE!D32)","v":"    "}]
[26,{"$f":"CONCATENATE(FILIACION_ESTUDIANTE!B33,\"  \",FILIACION_ESTUDIANTE!C33,\"  \",FILIACION_ESTUDIANTE!D33)","v":"    "}]
[27,{"$f":"CONCATENATE(FILIACION_ESTUDIANTE!B34,\"  \",FILIACION_ESTUDIANTE!C34,\"  \",FILIACION_ESTUDIANTE!D34)","v":"    "}]
[28,{"$f":"CONCATENATE(FILIACION_ESTUDIANTE!B35,\"  \",FILIACION_ESTUDIANTE!C35,\"  \",FILIACION_ESTUDIANTE!D35)","v":"    "}]
[29,{"$f":"CONCATENATE(FILIACION_ESTUDIANTE!B36,\"  \",FILIACION_ESTUDIANTE!C36,\"  \",FILIACION_ESTUDIANTE!D36)","v":"    "}]
[30,{"$f":"CONCATENATE(FILIACION_ESTUDIANTE!B37,\"  \",FILIACION_ESTUDIANTE!C37,\"  \",FILIACION_ESTUDIANTE!D37)","v":"    "}]
[31,{"$f":"CONCATENATE(FILIACION_ESTUDIANTE!B38,\"  \",FILIACION_ESTUDIANTE!C38,\"  \",FILIACION_ESTUDIANTE!D38)","v":"    "}]
[32,{"$f":"CONCATENATE(FILIACION_ESTUDIANTE!B39,\"  \",FILIACION_ESTUDIANTE!C39,\"  \",FILIACION_ESTUDIANTE!D39)","v":"    "}]
[33,{"$f":"CONCATENATE(FILIACION_ESTUDIANTE!B40,\"  \",FILIACION_ESTUDIANTE!C40,\"  \",FILIACION_ESTUDIANTE!D40)","v":"    "}]
[34,{"$f":"CONCATENATE(FILIACION_ESTUDIANTE!B41,\"  \",FILIACION_ESTUDIANTE!C41,\"  \",FILIACION_ESTUDIANTE!D41)","v":"    "}]
[35,{"$f":"CONCATENATE(FILIACION_ESTUDIANTE!B42,\"  \",FILIACION_ESTUDIANTE!C42,\"  \",FILIACION_ESTUDIANTE!D42)","v":"    "}]
[36,{"$f":"CONCATENATE(FILIACION_ESTUDIANTE!B43,\"  \",FILIACION_ESTUDIANTE!C43,\"  \",FILIACION_ESTUDIANTE!D43)","v":"    "}]
[37,{"$f":"CONCATENATE(FILIACION_ESTUDIANTE!B44,\"  \",FILIACION_ESTUDIANTE!C44,\"  \",FILIACION_ESTUDIANTE!D44)","v":"    "}]
[38,{"$f":"CONCATENATE(FILIACION_ESTUDIANTE!B45,\"  \",FILIACION_ESTUDIANTE!C45,\"  \",FILIACION_ESTUDIANTE!D45)","v":"    "}]
[39,{"$f":"CONCATENATE(FILIACION_ESTUDIANTE!B46,\"  \",FILIACION_ESTUDIANTE!C46,\"  \",FILIACION_ESTUDIANTE!D46)","v":"    "}]
[40,{"$f":"CONCATENATE(FILIACION_ESTUDIANTE!B47,\"  \",FILIACION_ESTUDIANTE!C47,\"  \",FILIACION_ESTUDIANTE!D47)","v":"    "}]

{"sheet":"COM_SOC_2B","index":22,"n_rows":53,"n_cols":48,"rows_kept":53,"cut":false,"hidden":false,"merged":[[11,14,12,14],[11,15,12,15],[11,16,12,16],[11,9,12,9],[11,10,12,10],[11,11,12,11],[11,12,12,12],[11,13,12,13],[11,4,12,4],[11,5,12,5],[11,6,12,6],[11,7,12,7],[11,8,12,8],[1,1,2,1],[1,2,1,19],[1,27,6,31],[2,2,2,19],[3,0,3,1],[3,2,3,11],[3,12,3,17],[3,18,3,20],[4,0,4,20],[5,0,5,1],[6,0,12,0],[6,2,6,5],[6,6,6,9],[6,10,6,13],[7,7,9,7],[7,8,9,8],[7,9,9,9],[6,18,8,19],[5,2,5,20],[7,14,9,14],[6,20,12,20],[7,6,9,6],[7,10,9,10],[7,11,9,11],[7,12,9,12],[7,13,9,13],[7,15,9,15],[7,16,9,16],[7,17,9,17],[6,14,6,17],[11,2,12,2],[11,3,12,3],[7,1,9,1],[7,2,9,2],[7,3,9,3],[7,4,9,4],[7,5,9,5],[13,18,13,19],[10,18,10,19],[11,17,12,17],[11,18,12,19],[14,18,14,19],[15,18,15,19],[16,18,16,19],[17,18,17,19],[18,18,18,19],[19,18,19,19],[20,18,20,19],[21,18,21,19],[22,18,22,19],[23,18,23,19],[24,18,24,19],[25,18,25,19],[26,18,26,19],[27,18,27,19],[28,18,28,19],[29,18,29,19],[30,18,30,19],[31,18,31,19],[32,18,32,19],[33,18,33,19],[34,18,34,19],[35,18,35,19],[36,18,36,19],[37,18,37,19],[38,18,38,19],[39,18,39,19],[40,18,40,19],[41,18,41,19],[42,18,42,19],[43,18,43,19],[49,18,49,19],[50,18,50,19],[51,18,51,19],[52,18,52,19],[44,18,44,19],[45,18,45,19],[46,18,46,19],[47,18,47,19],[48,18,48,19]]}
[]
[null,null,"CUADRO DE VALORACIÓN",null,null,null,null,null,null,null,null,null,null,null,null,null,null,null,null,null,null,null,null,null,null,null,null,"REGISTRO DE VALORACION",null,null,null,null,"ED",null,null,null,null,null,null,null,"DA","DO",null,"DP"]
[null,null,"EDUCACIÓN INICIAL  EN FAMILIA COMUNITARIA ",null,null,null,null,null,null,null,null,null,null,null,null,null,null,null,null,null,"2° BIMESTRE"]
[{"$f":"UPPER( CARATULA!$C$20)","v":"MAESTRA (O):"},null,{"$f":"CARATULA!$E$20","v":0},null,null,null,null,null,null,null,null,null,{"$f":"UPPER(CARATULA!$C$21)","v":"AÑO DE ESCOLARIDAD:"},null,null,null,null,null,{"$f":"CARATULA!$E$21","v":0}]
["CAMPO DE SABER Y CONOCIMIENTO COMUNIDAD Y SOCIEDAD"]
["EVALUACIÓN",null,"CRITERIOS DE LAS DIMENSIONES"]
["Nº","DIMENSIONES","SER",null,null,null,"SABER",null,null,null,"HACER",null,null,null,"DECIDIR",null,null,null,"AUTOEVALUACIÓN (SER, SABER, HACER, DECIDIR)",null,"SÍNTESIS CUALITATIVA DEL BIMESTRE"]
[null,"PLANES DE CLASE (PDC)","PDC","PDC","PDC","PDC","PDC","PDC","PDC","PDC","PDC","PDC","PDC","PDC","PDC","PDC","PDC","PDC"]
[null,null,null,null,null,null,null,null,null,null,null,null,null,null,null,null,null,null,null,null,null,null,null,null,null,null,null,"DP","DO","DA","ED"]
[null,null,null,null,null,null,null,null,null,null,null,null,null,null,null,null,null,null,null,null,null,null,null,null,null,null,null,14,8,5,1]
[null,"CRITERIOS DE EVALUACIÓN"]
[null,"INSTRUMENTOS Y/O ESTRATEGIAS DE EVALUACIÓN"]
[null,"APELLIDOS Y NOMBRES"]
[1,{"$f":"CONCATENATE(FILIACION_ESTUDIANTE!B8,\"  \",FILIACION_ESTUDIANTE!C8,\"  \",FILIACION_ESTUDIANTE!D8)","v":"    "},null,null,null,null,null,null,null,null,null,null,null,null,null,null,null,null,null,null,null,null,null,"demuestra  algunas actitudes armonicas etre sfamilia Y  LE FALTAT",null,null,null,{"$f":"IF(C14=$AB$9,$AB$10,IF(C14=$AC$9,$AC$10,IF(C14=$AD$9,$AD$10,IF(C14=$AE$9,$AE$10))))","v":false},{"$f":"IF(D14=$AB$9,$AB$10,IF(D14=$AC$9,$AC$10,IF(D14=$AD$9,$AD$10,IF(D14=$AE$9,$AE$10))))","v":false},{"$f":"IF(E14=$AB$9,$AB$10,IF(E14=$AC$9,$AC$10,IF(E14=$AD$9,$AD$10,IF(E14=$AE$9,$AE$10))))","v":false},{"$f":"IF(F14=$AB$9,$AB$10,IF(F14=$AC$9,$AC$10,IF(F14=$AD$9,$AD$10,IF(F14=$AE$9,$AE$10))))","v":false},{"$f":"SUM(AB14:AE14)","v":0},{"$f":"IF(G14=$AB$9,$AB$10,IF(G14=$AC$9,$AC$10,IF(G14=$AD$9,$AD$10,IF(G14=$AE$9,$AE$10))))","v":false},{"$f":"IF(H14=$AB$9,$AB$10,IF(H14=$AC$9,$AC$10,IF(H14=$AD$9,$AD$10,IF(H14=$AE$9,$AE$10))))","v":false},{"$f":"IF(I14=$AB$9,$AB$10,IF(I14=$AC$9,$AC$10,IF(I14=$AD$9,$AD$10,IF(I14=$AE$9,$AE$10))))","v":false},{"$f":"IF(J14=$AB$9,$AB$10,IF(J14=$AC$9,$AC$10,IF(J14=$AD$9,$AD$10,IF(J14=$AE$9,$AE$10))))","v":false},{"$f":"SUM(AG14:AJ14)","v":0},{"$f":"IF(K14=$AB$9,$AB$10,IF(K14=$AC$9,$AC$10,IF(K14=$AD$9,$AD$10,IF(K14=$AE$9,$AE$10))))","v":false},{"$f":"IF(L14=$AB$9,$AB$10,IF(L14=$AC$9,$AC$10,IF(L14=$AD$9,$AD$10,IF(L14=$AE$9,$AE$10))))","v":false},{"$f":"IF(M14=$AB$9,$AB$10,IF(M14=$AC$9,$AC$10,IF(M14=$AD$9,$AD$10,IF(M14=$AE$9,$AE$10))))","v":false},{"$f":"IF(N14=$AB$9,$AB$10,IF(N14=$AC$9,$AC$10,IF(N14=$AD$9,$AD$10,IF(N14=$AE$9,$AE$10))))","v":false},{"$f":"SUM(AL14:AO14)","v":0},{"$f":"IF(O14=$AB$9,$AB$10,IF(O14=$AC$9,$AC$10,IF(O14=$AD$9,$AD$10,IF(O14=$AE$9,$AE$10))))","v":false},{"$f":"IF(P14=$AB$9,$AB$10,IF(P14=$AC$9,$AC$10,IF(P14=$AD$9,$AD$10,IF(P14=$AE$9,$AE$10))))","v":false},{"$f":"IF(Q14=$AB$9,$AB$10,IF(Q14=$AC$9,$AC$10,IF(Q14=$AD$9,$AD$10,IF(Q14=$AE$9,$AE$10))))","v":false},{"$f":"IF(R14=$AB$9,$AB$10,IF(R14=$AC$9,$AC$10,IF(R14=$AD$9,$AD$10,IF(R14=$AE$9,$AE$10))))","v":false},{"$f":"SUM(AQ14:AT14)","v":0},{"$f":"MAX(AF14,AK14,AP14,AU14)","v":0}]
[2,{"$f":"CONCATENATE(FILIACION_ESTUDIANTE!B9,\"  \",FILIACION_ESTUDIANTE!C9,\"  \",FILIACION_ESTUDIANTE!D9)","v":"    "}]
[3,{"$f":"CONCATENATE(FILIACION_ESTUDIANTE!B10,\"  \",FILIACION_ESTUDIANTE!C10,\"  \",FILIACION_ESTUDIANTE!D10)","v":"    "}]
[4,{"$f":"CONCATENATE(FILIACION_ESTUDIANTE!B11,\"  \",FILIACION_ESTUDIANTE!C11,\"  \",FILIACION_ESTUDIANTE!D11)","v":"    "}]
[5,{"$f":"CONCATENATE(FILIACION_ESTUDIANTE!B12,\"  \",FILIACION_ESTUDIANTE!C12,\"  \",FILIACION_ESTUDIANTE!D12)","v":"    "}]
[6,{"$f":"CONCATENATE(FILIACION_ESTUDIANTE!B13,\"  \",FILIACION_ESTUDIANTE!C13,\"  \",FILIACION_ESTUDIANTE!D13)","v":"    "}]
[7,{"$f":"CONCATENATE(FILIACION_ESTUDIANTE!B14,\"  \",FILIACION_ESTUDIANTE!C14,\"  \",FILIACION_ESTUDIANTE!D14)","v":"    "}]
[8,{"$f":"CONCATENATE(FILIACION_ESTUDIANTE!B15,\"  \",FILIACION_ESTUDIANTE!C15,\"  \",FILIACION_ESTUDIANTE!D15)","v":"    "}]
[9,{"$f":"CONCATENATE(FILIACION_ESTUDIANTE!B16,\"  \",FILIACION_ESTUDIANTE!C16,\"  \",FILIACION_ESTUDIANTE!D16)","v":"    "}]
[10,{"$f":"CONCATENATE(FILIACION_ESTUDIANTE!B17,\"  \",FILIACION_ESTUDIANTE!C17,\"  \",FILIACION_ESTUDIANTE!D17)","v":"    "}]
[11,{"$f":"CONCATENATE(FILIACION_ESTUDIANTE!B18,\"  \",FILIACION_ESTUDIANTE!C18,\"  \",FILIACION_ESTUDIANTE!D18)","v":"    "}]
[12,{"$f":"CONCATENATE(FILIACION_ESTUDIANTE!B19,\"  \",FILIACION_ESTUDIANTE!C19,\"  \",FILIACION_ESTUDIANTE!D19)","v":"    "}]
[13,{"$f":"CONCATENATE(FILIACION_ESTUDIANTE!B20,\"  \",FILIACION_ESTUDIANTE!C20,\"  \",FILIACION_ESTUDIANTE!D20)","v":"    "}]
[14,{"$f":"CONCATENATE(FILIACION_ESTUDIANTE!B21,\"  \",FILIACION_ESTUDIANTE!C21,\"  \",FILIACION_ESTUDIANTE!D21)","v":"    "}]
[15,{"$f":"CONCATENATE(FILIACION_ESTUDIANTE!B22,\"  \",FILIACION_ESTUDIANTE!C22,\"  \",FILIACION_ESTUDIANTE!D22)","v":"    "}]
[16,{"$f":"CONCATENATE(FILIACION_ESTUDIANTE!B23,\"  \",FILIACION_ESTUDIANTE!C23,\"  \",FILIACION_ESTUDIANTE!D23)","v":"    "}]
[17,{"$f":"CONCATENATE(FILIACION_ESTUDIANTE!B24,\"  \",FILIACION_ESTUDIANTE!C24,\"  \",FILIACION_ESTUDIANTE!D24)","v":"    "}]
[18,{"$f":"CONCATENATE(FILIACION_ESTUDIANTE!B25,\"  \",FILIACION_ESTUDIANTE!C25,\"  \",FILIACION_ESTUDIANTE!D25)","v":"    "}]
[19,{"$f":"CONCATENATE(FILIACION_ESTUDIANTE!B26,\"  \",FILIACION_ESTUDIANTE!C26,\"  \",FILIACION_ESTUDIANTE!D26)","v":"    "}]
[20,{"$f":"CONCATENATE(FILIACION_ESTUDIANTE!B27,\"  \",FILIACION_ESTUDIANTE!C27,\"  \",FILIACION_ESTUDIANTE!D27)","v":"    "}]
[21,{"$f":"CONCATENATE(FILIACION_ESTUDIANTE!B28,\"  \",FILIACION_ESTUDIANTE!C28,\"  \",FILIACION_ESTUDIANTE!D28)","v":"    "}]
[22,{"$f":"CONCATENATE(FILIACION_ESTUDIANTE!B29,\"  \",FILIACION_ESTUDIANTE!C29,\"  \",FILIACION_ESTUDIANTE!D29)","v":"    "}]
[23,{"$f":"CONCATENATE(FILIACION_ESTUDIANTE!B30,\"  \",FILIACION_ESTUDIANTE!C30,\"  \",FILIACION_ESTUDIANTE!D30)","v":"    "}]
[24,{"$f":"CONCATENATE(FILIACION_ESTUDIANTE!B31,\"  \",FILIACION_ESTUDIANTE!C31,\"  \",FILIACION_ESTUDIANTE!D31)","v":"    "}]
[25,{"$f":"CONCATENATE(FILIACION_ESTUDIANTE!B32,\"  \",FILIACION_ESTUDIANTE!C32,\"  \",FILIACION_ESTUDIANTE!D32)","v":"    "}]
[26,{"$f":"CONCATENATE(FILIACION_ESTUDIANTE!B33,\"  \",FILIACION_ESTUDIANTE!C33,\"  \",FILIACION_ESTUDIANTE!D33)","v":"    "}]
[27,{"$f":"CONCATENATE(FILIACION_ESTUDIANTE!B34,\"  \",FILIACION_ESTUDIANTE!C34,\"  \",FILIACION_ESTUDIANTE!D34)","v":"    "}]
[28,{"$f":"CONCATENATE(FILIACION_ESTUDIANTE!B35,\"  \",FILIACION_ESTUDIANTE!C35,\"  \",FILIACION_ESTUDIANTE!D35)","v":"    "}]
[29,{"$f":"CONCATENATE(FILIACION_ESTUDIANTE!B36,\"  \",FILIACION_ESTUDIANTE!C36,\"  \",FILIACION_ESTUDIANTE!D36)","v":"    "}]
[30,{"$f":"CONCATENATE(FILIACION_ESTUDIANTE!B37,\"  \",FILIACION_ESTUDIANTE!C37,\"  \",FILIACION_ESTUDIANTE!D37)","v":"    "}]
[31,{"$f":"CONCATENATE(FILIACION_ESTUDIANTE!B38,\"  \",FILIACION_ESTUDIANTE!C38,\"  \",FILIACION_ESTUDIANTE!D38)","v":"    "}]
[32,{"$f":"CONCATENATE(FILIACION_ESTUDIANTE!B39,\"  \",FILIACION_ESTUDIANTE!C39,\"  \",FILIACION_ESTUDIANTE!D39)","v":"    "}]
[33,{"$f":"CONCATENATE(FILIACION_ESTUDIANTE!B40,\"  \",FILIACION_ESTUDIANTE!C40,\"  \",FILIACION_ESTUDIANTE!D40)","v":"    "}]
[34,{"$f":"CONCATENATE(FILIACION_ESTUDIANTE!B41,\"  \",FILIACION_ESTUDIANTE!C41,\"  \",FILIACION_ESTUDIANTE!D41)","v":"    "}]
[35,{"$f":"CONCATENATE(FILIACION_ESTUDIANTE!B42,\"  \",FILIACION_ESTUDIANTE!C42,\"  \",FILIACION_ESTUDIANTE!D42)","v":"    "}]
[36,{"$f":"CONCATENATE(FILIACION_ESTUDIANTE!B43,\"  \",FILIACION_ESTUDIANTE!C43,\"  \",FILIACION_ESTUDIANTE!D43)","v":"    "}]
[37,{"$f":"CONCATENATE(FILIACION_ESTUDIANTE!B44,\"  \",FILIACION_ESTUDIANTE!C44,\"  \",FILIACION_ESTUDIANTE!D44)","v":"    "}]
[38,{"$f":"CONCATENATE(FILIACION_ESTUDIANTE!B45,\"  \",FILIACION_ESTUDIANTE!C45,\"  \",FILIACION_ESTUDIANTE!D45)","v":"    "}]
[39,{"$f":"CONCATENATE(FILIACION_ESTUDIANTE!B46,\"  \",FILIACION_ESTUDIANTE!C46,\"  \",FILIACION_ESTUDIANTE!D46)","v":"    "}]
[40,{"$f":"CONCATENATE(FILIACION_ESTUDIANTE!B47,\"  \",FILIACION_ESTUDIANTE!C47,\"  \",FILIACION_ESTUDIANTE!D47)","v":"    "}]

{"sheet":"COM_SOC_3B","index":23,"n_rows":53,"n_cols":48,"rows_kept":53,"cut":false,"hidden":false,"merged":[[11,14,12,14],[11,7,12,7],[11,8,12,8],[11,9,12,9],[11,10,12,10],[11,11,12,11],[11,2,12,2],[11,3,12,3],[11,4,12,4],[11,5,12,5],[11,6,12,6],[33,18,33,19],[34,18,34,19],[35,18,35,19],[36,18,36,19],[37,18,37,19],[38,18,38,19],[39,18,39,19],[40,18,40,19],[41,18,41,19],[42,18,42,19],[51,18,51,19],[52,18,52,19],[43,18,43,19],[44,18,44,19],[45,18,45,19],[46,18,46,19],[47,18,47,19],[48,18,48,19],[49,18,49,19],[50,18,50,19],[29,18,29,19],[30,18,30,19],[31,18,31,19],[32,18,32,19],[23,18,23,19],[24,18,24,19],[25,18,25,19],[26,18,26,19],[27,18,27,19],[28,18,28,19],[18,18,18,19],[19,18,19,19],[20,18,20,19],[21,18,21,19],[22,18,22,19],[13,18,13,19],[14,18,14,19],[15,18,15,19],[16,18,16,19],[17,18,17,19],[1,1,2,1],[1,2,1,19],[1,27,6,31],[2,2,2,19],[3,0,3,1],[3,2,3,11],[3,12,3,17],[3,18,3,20],[4,0,4,20],[5,0,5,1],[6,0,12,0],[6,2,6,5],[6,6,6,9],[6,10,6,13],[6,14,6,17],[5,2,5,20],[7,6,9,6],[7,7,9,7],[7,8,9,8],[7,9,9,9],[7,10,9,10],[7,1,9,1],[7,2,9,2],[7,3,9,3],[7,4,9,4],[7,5,9,5],[6,18,8,19],[7,11,9,11],[7,12,9,12],[7,14,9,14],[6,20,12,20],[7,13,9,13],[7,15,9,15],[7,16,9,16],[7,17,9,17],[11,15,12,15],[11,16,12,16],[11,17,12,17],[11,18,12,19],[10,18,10,19],[11,12,12,12],[11,13,12,13]]}
[]
[null,null,"CUADRO DE VALORACIÓN",null,null,null,null,null,null,null,null,null,null,null,null,null,null,null,null,null,null,null,null,null,null,null,null,"REGISTRO DE VALORACION",null,null,null,null,"ED",null,null,null,null,null,null,null,"DA","DO",null,"DP"]
[null,null,"EDUCACIÓN INICIAL  EN FAMILIA COMUNITARIA ",null,null,null,null,null,null,null,null,null,null,null,null,null,null,null,null,null,"3er BIMESTRE"]
[{"$f":"UPPER( CARATULA!$C$20)","v":"MAESTRA (O):"},null,{"$f":"CARATULA!$E$20","v":0},null,null,null,null,null,null,null,null,null,{"$f":"UPPER(CARATULA!$C$21)","v":"AÑO DE ESCOLARIDAD:"},null,null,null,null,null,{"$f":"CARATULA!$E$21","v":0}]
["CAMPO DE SABER Y CONOCIMIENTO COMUNIDAD Y SOCIEDAD"]
["EVALUACIÓN",null,"CRITERIOS DE LAS DIMENSIONES"]
["Nº","DIMENSIONES","SER",null,null,null,"SABER",null,null,null,"HACER",null,null,null,"DECIDIR",null,null,null,"AUTOEVALUACIÓN (SER, SABER, HACER, DECIDIR)",null,"SÍNTESIS CUALITATIVA DEL BIMESTRE"]
[null,"PLANES DE CLASE (PDC)","PDC","PDC","PDC","PDC","PDC","PDC","PDC","PDC","PDC","PDC","PDC","PDC","PDC","PDC","PDC","PDC"]
[null,null,null,null,null,null,null,null,null,null,null,null,null,null,null,null,null,null,null,null,null,null,null,null,null,null,null,"DP","DO","DA","ED"]
[null,null,null,null,null,null,null,null,null,null,null,null,null,null,null,null,null,null,null,null,null,null,null,null,null,null,null,14,8,5,1]
[null,"CRITERIOS DE EVALUACIÓN"]
[null,"INSTRUMENTOS Y/O ESTRATEGIAS DE EVALUACIÓN"]
[null,"APELLIDOS Y NOMBRES"]
[1,{"$f":"CONCATENATE(FILIACION_ESTUDIANTE!B8,\"  \",FILIACION_ESTUDIANTE!C8,\"  \",FILIACION_ESTUDIANTE!D8)","v":"    "},null,null,null,null,null,null,null,null,null,null,null,null,null,null,null,null,null,null,null,null,null,"demuestra  algunas actitudes armonicas etre sfamilia Y  LE FALTAT",null,null,null,{"$f":"IF(C14=$AB$9,$AB$10,IF(C14=$AC$9,$AC$10,IF(C14=$AD$9,$AD$10,IF(C14=$AE$9,$AE$10))))","v":false},{"$f":"IF(D14=$AB$9,$AB$10,IF(D14=$AC$9,$AC$10,IF(D14=$AD$9,$AD$10,IF(D14=$AE$9,$AE$10))))","v":false},{"$f":"IF(E14=$AB$9,$AB$10,IF(E14=$AC$9,$AC$10,IF(E14=$AD$9,$AD$10,IF(E14=$AE$9,$AE$10))))","v":false},{"$f":"IF(F14=$AB$9,$AB$10,IF(F14=$AC$9,$AC$10,IF(F14=$AD$9,$AD$10,IF(F14=$AE$9,$AE$10))))","v":false},{"$f":"SUM(AB14:AE14)","v":0},{"$f":"IF(G14=$AB$9,$AB$10,IF(G14=$AC$9,$AC$10,IF(G14=$AD$9,$AD$10,IF(G14=$AE$9,$AE$10))))","v":false},{"$f":"IF(H14=$AB$9,$AB$10,IF(H14=$AC$9,$AC$10,IF(H14=$AD$9,$AD$10,IF(H14=$AE$9,$AE$10))))","v":false},{"$f":"IF(I14=$AB$9,$AB$10,IF(I14=$AC$9,$AC$10,IF(I14=$AD$9,$AD$10,IF(I14=$AE$9,$AE$10))))","v":false},{"$f":"IF(J14=$AB$9,$AB$10,IF(J14=$AC$9,$AC$10,IF(J14=$AD$9,$AD$10,IF(J14=$AE$9,$AE$10))))","v":false},{"$f":"SUM(AG14:AJ14)","v":0},{"$f":"IF(K14=$AB$9,$AB$10,IF(K14=$AC$9,$AC$10,IF(K14=$AD$9,$AD$10,IF(K14=$AE$9,$AE$10))))","v":false},{"$f":"IF(L14=$AB$9,$AB$10,IF(L14=$AC$9,$AC$10,IF(L14=$AD$9,$AD$10,IF(L14=$AE$9,$AE$10))))","v":false},{"$f":"IF(M14=$AB$9,$AB$10,IF(M14=$AC$9,$AC$10,IF(M14=$AD$9,$AD$10,IF(M14=$AE$9,$AE$10))))","v":false},{"$f":"IF(N14=$AB$9,$AB$10,IF(N14=$AC$9,$AC$10,IF(N14=$AD$9,$AD$10,IF(N14=$AE$9,$AE$10))))","v":false},{"$f":"SUM(AL14:AO14)","v":0},{"$f":"IF(O14=$AB$9,$AB$10,IF(O14=$AC$9,$AC$10,IF(O14=$AD$9,$AD$10,IF(O14=$AE$9,$AE$10))))","v":false},{"$f":"IF(P14=$AB$9,$AB$10,IF(P14=$AC$9,$AC$10,IF(P14=$AD$9,$AD$10,IF(P14=$AE$9,$AE$10))))","v":false},{"$f":"IF(Q14=$AB$9,$AB$10,IF(Q14=$AC$9,$AC$10,IF(Q14=$AD$9,$AD$10,IF(Q14=$AE$9,$AE$10))))","v":false},{"$f":"IF(R14=$AB$9,$AB$10,IF(R14=$AC$9,$AC$10,IF(R14=$AD$9,$AD$10,IF(R14=$AE$9,$AE$10))))","v":false},{"$f":"SUM(AQ14:AT14)","v":0},{"$f":"MAX(AF14,AK14,AP14,AU14)","v":0}]
[2,{"$f":"CONCATENATE(FILIACION_ESTUDIANTE!B9,\"  \",FILIACION_ESTUDIANTE!C9,\"  \",FILIACION_ESTUDIANTE!D9)","v":"    "}]
[3,{"$f":"CONCATENATE(FILIACION_ESTUDIANTE!B10,\"  \",FILIACION_ESTUDIANTE!C10,\"  \",FILIACION_ESTUDIANTE!D10)","v":"    "}]
[4,{"$f":"CONCATENATE(FILIACION_ESTUDIANTE!B11,\"  \",FILIACION_ESTUDIANTE!C11,\"  \",FILIACION_ESTUDIANTE!D11)","v":"    "}]
[5,{"$f":"CONCATENATE(FILIACION_ESTUDIANTE!B12,\"  \",FILIACION_ESTUDIANTE!C12,\"  \",FILIACION_ESTUDIANTE!D12)","v":"    "}]
[6,{"$f":"CONCATENATE(FILIACION_ESTUDIANTE!B13,\"  \",FILIACION_ESTUDIANTE!C13,\"  \",FILIACION_ESTUDIANTE!D13)","v":"    "}]
[7,{"$f":"CONCATENATE(FILIACION_ESTUDIANTE!B14,\"  \",FILIACION_ESTUDIANTE!C14,\"  \",FILIACION_ESTUDIANTE!D14)","v":"    "}]
[8,{"$f":"CONCATENATE(FILIACION_ESTUDIANTE!B15,\"  \",FILIACION_ESTUDIANTE!C15,\"  \",FILIACION_ESTUDIANTE!D15)","v":"    "}]
[9,{"$f":"CONCATENATE(FILIACION_ESTUDIANTE!B16,\"  \",FILIACION_ESTUDIANTE!C16,\"  \",FILIACION_ESTUDIANTE!D16)","v":"    "}]
[10,{"$f":"CONCATENATE(FILIACION_ESTUDIANTE!B17,\"  \",FILIACION_ESTUDIANTE!C17,\"  \",FILIACION_ESTUDIANTE!D17)","v":"    "}]
[11,{"$f":"CONCATENATE(FILIACION_ESTUDIANTE!B18,\"  \",FILIACION_ESTUDIANTE!C18,\"  \",FILIACION_ESTUDIANTE!D18)","v":"    "}]
[12,{"$f":"CONCATENATE(FILIACION_ESTUDIANTE!B19,\"  \",FILIACION_ESTUDIANTE!C19,\"  \",FILIACION_ESTUDIANTE!D19)","v":"    "}]
[13,{"$f":"CONCATENATE(FILIACION_ESTUDIANTE!B20,\"  \",FILIACION_ESTUDIANTE!C20,\"  \",FILIACION_ESTUDIANTE!D20)","v":"    "}]
[14,{"$f":"CONCATENATE(FILIACION_ESTUDIANTE!B21,\"  \",FILIACION_ESTUDIANTE!C21,\"  \",FILIACION_ESTUDIANTE!D21)","v":"    "}]
[15,{"$f":"CONCATENATE(FILIACION_ESTUDIANTE!B22,\"  \",FILIACION_ESTUDIANTE!C22,\"  \",FILIACION_ESTUDIANTE!D22)","v":"    "}]
[16,{"$f":"CONCATENATE(FILIACION_ESTUDIANTE!B23,\"  \",FILIACION_ESTUDIANTE!C23,\"  \",FILIACION_ESTUDIANTE!D23)","v":"    "}]
[17,{"$f":"CONCATENATE(FILIACION_ESTUDIANTE!B24,\"  \",FILIACION_ESTUDIANTE!C24,\"  \",FILIACION_ESTUDIANTE!D24)","v":"    "}]
[18,{"$f":"CONCATENATE(FILIACION_ESTUDIANTE!B25,\"  \",FILIACION_ESTUDIANTE!C25,\"  \",FILIACION_ESTUDIANTE!D25)","v":"    "}]
[19,{"$f":"CONCATENATE(FILIACION_ESTUDIANTE!B26,\"  \",FILIACION_ESTUDIANTE!C26,\"  \",FILIACION_ESTUDIANTE!D26)","v":"    "}]
[20,{"$f":"CONCATENATE(FILIACION_ESTUDIANTE!B27,\"  \",FILIACION_ESTUDIANTE!C27,\"  \",FILIACION_ESTUDIANTE!D27)","v":"    "}]
[21,{"$f":"CONCATENATE(FILIACION_ESTUDIANTE!B28,\"  \",FILIACION_ESTUDIANTE!C28,\"  \",FILIACION_ESTUDIANTE!D28)","v":"    "}]
[22,{"$f":"CONCATENATE(FILIACION_ESTUDIANTE!B29,\"  \",FILIACION_ESTUDIANTE!C29,\"  \",FILIACION_ESTUDIANTE!D29)","v":"    "}]
[23,{"$f":"CONCATENATE(FILIACION_ESTUDIANTE!B30,\"  \",FILIACION_ESTUDIANTE!C30,\"  \",FILIACION_ESTUDIANTE!D30)","v":"    "}]
[24,{"$f":"CONCATENATE(FILIACION_ESTUDIANTE!B31,\"  \",FILIACION_ESTUDIANTE!C31,\"  \",FILIACION_ESTUDIANTE!D31)","v":"    "}]
[25,{"$f":"CONCATENATE(FILIACION_ESTUDIANTE!B32,\"  \",FILIACION_ESTUDIANTE!C32,\"  \",FILIACION_ESTUDIANTE!D32)","v":"    "}]
[26,{"$f":"CONCATENATE(FILIACION_ESTUDIANTE!B33,\"  \",FILIACION_ESTUDIANTE!C33,\"  \",FILIACION_ESTUDIANTE!D33)","v":"    "}]
[27,{"$f":"CONCATENATE(FILIACION_ESTUDIANTE!B34,\"  \",FILIACION_ESTUDIANTE!C34,\"  \",FILIACION_ESTUDIANTE!D34)","v":"    "}]
[28,{"$f":"CONCATENATE(FILIACION_ESTUDIANTE!B35,\"  \",FILIACION_ESTUDIANTE!C35,\"  \",FILIACION_ESTUDIANTE!D35)","v":"    "}]
[29,{"$f":"CONCATENATE(FILIACION_ESTUDIANTE!B36,\"  \",FILIACION_ESTUDIANTE!C36,\"  \",FILIACION_ESTUDIANTE!D36)","v":"    "}]
[30,{"$f":"CONCATENATE(FILIACION_ESTUDIANTE!B37,\"  \",FILIACION_ESTUDIANTE!C37,\"  \",FILIACION_ESTUDIANTE!D37)","v":"    "}]
[31,{"$f":"CONCATENATE(FILIACION_ESTUDIANTE!B38,\"  \",FILIACION_ESTUDIANTE!C38,\"  \",FILIACION_ESTUDIANTE!D38)","v":"    "}]
[32,{"$f":"CONCATENATE(FILIACION_ESTUDIANTE!B39,\"  \",FILIACION_ESTUDIANTE!C39,\"  \",FILIACION_ESTUDIANTE!D39)","v":"    "}]
[33,{"$f":"CONCATENATE(FILIACION_ESTUDIANTE!B40,\"  \",FILIACION_ESTUDIANTE!C40,\"  \",FILIACION_ESTUDIANTE!D40)","v":"    "}]
[34,{"$f":"CONCATENATE(FILIACION_ESTUDIANTE!B41,\"  \",FILIACION_ESTUDIANTE!C41,\"  \",FILIACION_ESTUDIANTE!D41)","v":"    "}]
[35,{"$f":"CONCATENATE(FILIACION_ESTUDIANTE!B42,\"  \",FILIACION_ESTUDIANTE!C42,\"  \",FILIACION_ESTUDIANTE!D42)","v":"    "}]
[36,{"$f":"CONCATENATE(FILIACION_ESTUDIANTE!B43,\"  \",FILIACION_ESTUDIANTE!C43,\"  \",FILIACION_ESTUDIANTE!D43)","v":"    "}]
[37,{"$f":"CONCATENATE(FILIACION_ESTUDIANTE!B44,\"  \",FILIACION_ESTUDIANTE!C44,\"  \",FILIACION_ESTUDIANTE!D44)","v":"    "}]
[38,{"$f":"CONCATENATE(FILIACION_ESTUDIANTE!B45,\"  \",FILIACION_ESTUDIANTE!C45,\"  \",FILIACION_ESTUDIANTE!D45)","v":"    "}]
[39,{"$f":"CONCATENATE(FILIACION_ESTUDIANTE!B46,\"  \",FILIACION_ESTUDIANTE!C46,\"  \",FILIACION_ESTUDIANTE!D46)","v":"    "}]
[40,{"$f":"CONCATENATE(FILIACION_ESTUDIANTE!B47,\"  \",FILIACION_ESTUDIANTE!C47,\"  \",FILIACION_ESTUDIANTE!D47)","v":"    "}]

{"sheet":"COM_SOC_4B","index":24,"n_rows":53,"n_cols":48,"rows_kept":53,"cut":false,"hidden":false,"merged":[[11,14,12,14],[11,7,12,7],[11,8,12,8],[11,9,12,9],[11,10,12,10],[11,11,12,11],[11,2,12,2],[11,3,12,3],[11,4,12,4],[11,5,12,5],[11,6,12,6],[33,18,33,19],[34,18,34,19],[35,18,35,19],[36,18,36,19],[37,18,37,19],[38,18,38,19],[39,18,39,19],[40,18,40,19],[41,18,41,19],[42,18,42,19],[51,18,51,19],[52,18,52,19],[43,18,43,19],[44,18,44,19],[45,18,45,19],[46,18,46,19],[47,18,47,19],[48,18,48,19],[49,18,49,19],[50,18,50,19],[29,18,29,19],[30,18,30,19],[31,18,31,19],[32,18,32,19],[23,18,23,19],[24,18,24,19],[25,18,25,19],[26,18,26,19],[27,18,27,19],[28,18,28,19],[18,18,18,19],[19,18,19,19],[20,18,20,19],[21,18,21,19],[22,18,22,19],[13,18,13,19],[14,18,14,19],[15,18,15,19],[16,18,16,19],[17,18,17,19],[1,1,2,1],[1,2,1,19],[1,27,6,31],[2,2,2,19],[3,0,3,1],[3,2,3,11],[3,12,3,17],[3,18,3,20],[4,0,4,20],[5,0,5,1],[6,0,12,0],[6,2,6,5],[6,6,6,9],[6,10,6,13],[6,14,6,17],[5,2,5,20],[7,6,9,6],[7,7,9,7],[7,8,9,8],[7,9,9,9],[7,10,9,10],[7,1,9,1],[7,2,9,2],[7,3,9,3],[7,4,9,4],[7,5,9,5],[6,18,8,19],[7,11,9,11],[7,12,9,12],[7,14,9,14],[6,20,12,20],[7,13,9,13],[7,15,9,15],[7,16,9,16],[7,17,9,17],[11,15,12,15],[11,16,12,16],[11,17,12,17],[11,18,12,19],[10,18,10,19],[11,12,12,12],[11,13,12,13]]}
[]
[null,null,"CUADRO DE VALORACIÓN",null,null,null,null,null,null,null,null,null,null,null,null,null,null,null,null,null,null,null,null,null,null,null,null,"REGISTRO DE VALORACION",null,null,null,null,"ED",null,null,null,null,null,null,null,"DA","DO",null,"DP"]
[null,null,"EDUCACIÓN INICIAL  EN FAMILIA COMUNITARIA ",null,null,null,null,null,null,null,null,null,null,null,null,null,null,null,null,null,"4° BIMESTRE"]
[{"$f":"UPPER( CARATULA!$C$20)","v":"MAESTRA (O):"},null,{"$f":"CARATULA!$E$20","v":0},null,null,null,null,null,null,null,null,null,{"$f":"UPPER(CARATULA!$C$21)","v":"AÑO DE ESCOLARIDAD:"},null,null,null,null,null,{"$f":"CARATULA!$E$21","v":0}]
["CAMPO DE SABER Y CONOCIMIENTO COMUNIDAD Y SOCIEDAD"]
["EVALUACIÓN",null,"CRITERIOS DE LAS DIMENSIONES"]
["Nº","DIMENSIONES","SER",null,null,null,"SABER",null,null,null,"HACER",null,null,null,"DECIDIR",null,null,null,"AUTOEVALUACIÓN (SER, SABER, HACER, DECIDIR)",null,"SÍNTESIS CUALITATIVA DEL BIMESTRE"]
[null,"PLANES DE CLASE (PDC)","PDC","PDC","PDC","PDC","PDC","PDC","PDC","PDC","PDC","PDC","PDC","PDC","PDC","PDC","PDC","PDC"]
[null,null,null,null,null,null,null,null,null,null,null,null,null,null,null,null,null,null,null,null,null,null,null,null,null,null,null,"DP","DO","DA","ED"]
[null,null,null,null,null,null,null,null,null,null,null,null,null,null,null,null,null,null,null,null,null,null,null,null,null,null,null,14,8,5,1]
[null,"CRITERIOS DE EVALUACIÓN"]
[null,"INSTRUMENTOS Y/O ESTRATEGIAS DE EVALUACIÓN"]
[null,"APELLIDOS Y NOMBRES"]
[1,{"$f":"CONCATENATE(FILIACION_ESTUDIANTE!B8,\"  \",FILIACION_ESTUDIANTE!C8,\"  \",FILIACION_ESTUDIANTE!D8)","v":"    "},null,null,null,null,null,null,null,null,null,null,null,null,null,null,null,null,null,null,null,null,null,"demuestra  algunas actitudes armonicas etre sfamilia Y  LE FALTAT",null,null,null,{"$f":"IF(C14=$AB$9,$AB$10,IF(C14=$AC$9,$AC$10,IF(C14=$AD$9,$AD$10,IF(C14=$AE$9,$AE$10))))","v":false},{"$f":"IF(D14=$AB$9,$AB$10,IF(D14=$AC$9,$AC$10,IF(D14=$AD$9,$AD$10,IF(D14=$AE$9,$AE$10))))","v":false},{"$f":"IF(E14=$AB$9,$AB$10,IF(E14=$AC$9,$AC$10,IF(E14=$AD$9,$AD$10,IF(E14=$AE$9,$AE$10))))","v":false},{"$f":"IF(F14=$AB$9,$AB$10,IF(F14=$AC$9,$AC$10,IF(F14=$AD$9,$AD$10,IF(F14=$AE$9,$AE$10))))","v":false},{"$f":"SUM(AB14:AE14)","v":0},{"$f":"IF(G14=$AB$9,$AB$10,IF(G14=$AC$9,$AC$10,IF(G14=$AD$9,$AD$10,IF(G14=$AE$9,$AE$10))))","v":false},{"$f":"IF(H14=$AB$9,$AB$10,IF(H14=$AC$9,$AC$10,IF(H14=$AD$9,$AD$10,IF(H14=$AE$9,$AE$10))))","v":false},{"$f":"IF(I14=$AB$9,$AB$10,IF(I14=$AC$9,$AC$10,IF(I14=$AD$9,$AD$10,IF(I14=$AE$9,$AE$10))))","v":false},{"$f":"IF(J14=$AB$9,$AB$10,IF(J14=$AC$9,$AC$10,IF(J14=$AD$9,$AD$10,IF(J14=$AE$9,$AE$10))))","v":false},{"$f":"SUM(AG14:AJ14)","v":0},{"$f":"IF(K14=$AB$9,$AB$10,IF(K14=$AC$9,$AC$10,IF(K14=$AD$9,$AD$10,IF(K14=$AE$9,$AE$10))))","v":false},{"$f":"IF(L14=$AB$9,$AB$10,IF(L14=$AC$9,$AC$10,IF(L14=$AD$9,$AD$10,IF(L14=$AE$9,$AE$10))))","v":false},{"$f":"IF(M14=$AB$9,$AB$10,IF(M14=$AC$9,$AC$10,IF(M14=$AD$9,$AD$10,IF(M14=$AE$9,$AE$10))))","v":false},{"$f":"IF(N14=$AB$9,$AB$10,IF(N14=$AC$9,$AC$10,IF(N14=$AD$9,$AD$10,IF(N14=$AE$9,$AE$10))))","v":false},{"$f":"SUM(AL14:AO14)","v":0},{"$f":"IF(O14=$AB$9,$AB$10,IF(O14=$AC$9,$AC$10,IF(O14=$AD$9,$AD$10,IF(O14=$AE$9,$AE$10))))","v":false},{"$f":"IF(P14=$AB$9,$AB$10,IF(P14=$AC$9,$AC$10,IF(P14=$AD$9,$AD$10,IF(P14=$AE$9,$AE$10))))","v":false},{"$f":"IF(Q14=$AB$9,$AB$10,IF(Q14=$AC$9,$AC$10,IF(Q14=$AD$9,$AD$10,IF(Q14=$AE$9,$AE$10))))","v":false},{"$f":"IF(R14=$AB$9,$AB$10,IF(R14=$AC$9,$AC$10,IF(R14=$AD$9,$AD$10,IF(R14=$AE$9,$AE$10))))","v":false},{"$f":"SUM(AQ14:AT14)","v":0},{"$f":"MAX(AF14,AK14,AP14,AU14)","v":0}]
[2,{"$f":"CONCATENATE(FILIACION_ESTUDIANTE!B9,\"  \",FILIACION_ESTUDIANTE!C9,\"  \",FILIACION_ESTUDIANTE!D9)","v":"    "}]
[3,{"$f":"CONCATENATE(FILIACION_ESTUDIANTE!B10,\"  \",FILIACION_ESTUDIANTE!C10,\"  \",FILIACION_ESTUDIANTE!D10)","v":"    "}]
[4,{"$f":"CONCATENATE(FILIACION_ESTUDIANTE!B11,\"  \",FILIACION_ESTUDIANTE!C11,\"  \",FILIACION_ESTUDIANTE!D11)","v":"    "}]
[5,{"$f":"CONCATENATE(FILIACION_ESTUDIANTE!B12,\"  \",FILIACION_ESTUDIANTE!C12,\"  \",FILIACION_ESTUDIANTE!D12)","v":"    "}]
[6,{"$f":"CONCATENATE(FILIACION_ESTUDIANTE!B13,\"  \",FILIACION_ESTUDIANTE!C13,\"  \",FILIACION_ESTUDIANTE!D13)","v":"    "},null,null,null,null,null,null,null,null,null,null,null,null,null,null,null,null,null,null,"GGGGGGGG"]
[7,{"$f":"CONCATENATE(FILIACION_ESTUDIANTE!B14,\"  \",FILIACION_ESTUDIANTE!C14,\"  \",FILIACION_ESTUDIANTE!D14)","v":"    "}]
[8,{"$f":"CONCATENATE(FILIACION_ESTUDIANTE!B15,\"  \",FILIACION_ESTUDIANTE!C15,\"  \",FILIACION_ESTUDIANTE!D15)","v":"    "}]
[9,{"$f":"CONCATENATE(FILIACION_ESTUDIANTE!B16,\"  \",FILIACION_ESTUDIANTE!C16,\"  \",FILIACION_ESTUDIANTE!D16)","v":"    "},null,null,null,null,null,null,null,null,null,null,null,null,null,null,null,null,null,null,"GGGGGGGG"]
[10,{"$f":"CONCATENATE(FILIACION_ESTUDIANTE!B17,\"  \",FILIACION_ESTUDIANTE!C17,\"  \",FILIACION_ESTUDIANTE!D17)","v":"    "}]
[11,{"$f":"CONCATENATE(FILIACION_ESTUDIANTE!B18,\"  \",FILIACION_ESTUDIANTE!C18,\"  \",FILIACION_ESTUDIANTE!D18)","v":"    "}]
[12,{"$f":"CONCATENATE(FILIACION_ESTUDIANTE!B19,\"  \",FILIACION_ESTUDIANTE!C19,\"  \",FILIACION_ESTUDIANTE!D19)","v":"    "},null,null,null,null,null,null,null,null,null,null,null,null,null,null,null,null,null,null,"GGGGGGGG"]
[13,{"$f":"CONCATENATE(FILIACION_ESTUDIANTE!B20,\"  \",FILIACION_ESTUDIANTE!C20,\"  \",FILIACION_ESTUDIANTE!D20)","v":"    "}]
[14,{"$f":"CONCATENATE(FILIACION_ESTUDIANTE!B21,\"  \",FILIACION_ESTUDIANTE!C21,\"  \",FILIACION_ESTUDIANTE!D21)","v":"    "}]
[15,{"$f":"CONCATENATE(FILIACION_ESTUDIANTE!B22,\"  \",FILIACION_ESTUDIANTE!C22,\"  \",FILIACION_ESTUDIANTE!D22)","v":"    "},null,null,null,null,null,null,null,null,null,null,null,null,null,null,null,null,null,null,"GGGGGGGG"]
[16,{"$f":"CONCATENATE(FILIACION_ESTUDIANTE!B23,\"  \",FILIACION_ESTUDIANTE!C23,\"  \",FILIACION_ESTUDIANTE!D23)","v":"    "}]
[17,{"$f":"CONCATENATE(FILIACION_ESTUDIANTE!B24,\"  \",FILIACION_ESTUDIANTE!C24,\"  \",FILIACION_ESTUDIANTE!D24)","v":"    "}]
[18,{"$f":"CONCATENATE(FILIACION_ESTUDIANTE!B25,\"  \",FILIACION_ESTUDIANTE!C25,\"  \",FILIACION_ESTUDIANTE!D25)","v":"    "},null,null,null,null,null,null,null,null,null,null,null,null,null,null,null,null,null,null,"GGGGGGGG"]
[19,{"$f":"CONCATENATE(FILIACION_ESTUDIANTE!B26,\"  \",FILIACION_ESTUDIANTE!C26,\"  \",FILIACION_ESTUDIANTE!D26)","v":"    "}]
[20,{"$f":"CONCATENATE(FILIACION_ESTUDIANTE!B27,\"  \",FILIACION_ESTUDIANTE!C27,\"  \",FILIACION_ESTUDIANTE!D27)","v":"    "}]
[21,{"$f":"CONCATENATE(FILIACION_ESTUDIANTE!B28,\"  \",FILIACION_ESTUDIANTE!C28,\"  \",FILIACION_ESTUDIANTE!D28)","v":"    "},null,null,null,null,null,null,null,null,null,null,null,null,null,null,null,null,null,null,"GGGGGGGG"]
[22,{"$f":"CONCATENATE(FILIACION_ESTUDIANTE!B29,\"  \",FILIACION_ESTUDIANTE!C29,\"  \",FILIACION_ESTUDIANTE!D29)","v":"    "}]
[23,{"$f":"CONCATENATE(FILIACION_ESTUDIANTE!B30,\"  \",FILIACION_ESTUDIANTE!C30,\"  \",FILIACION_ESTUDIANTE!D30)","v":"    "}]
[24,{"$f":"CONCATENATE(FILIACION_ESTUDIANTE!B31,\"  \",FILIACION_ESTUDIANTE!C31,\"  \",FILIACION_ESTUDIANTE!D31)","v":"    "},null,null,null,null,null,null,null,null,null,null,null,null,null,null,null,null,null,null,"GGGGGGGG"]
[25,{"$f":"CONCATENATE(FILIACION_ESTUDIANTE!B32,\"  \",FILIACION_ESTUDIANTE!C32,\"  \",FILIACION_ESTUDIANTE!D32)","v":"    "}]
[26,{"$f":"CONCATENATE(FILIACION_ESTUDIANTE!B33,\"  \",FILIACION_ESTUDIANTE!C33,\"  \",FILIACION_ESTUDIANTE!D33)","v":"    "}]
[27,{"$f":"CONCATENATE(FILIACION_ESTUDIANTE!B34,\"  \",FILIACION_ESTUDIANTE!C34,\"  \",FILIACION_ESTUDIANTE!D34)","v":"    "},null,null,null,null,null,null,null,null,null,null,null,null,null,null,null,null,null,null,"GGGGGGGG"]
[28,{"$f":"CONCATENATE(FILIACION_ESTUDIANTE!B35,\"  \",FILIACION_ESTUDIANTE!C35,\"  \",FILIACION_ESTUDIANTE!D35)","v":"    "}]
[29,{"$f":"CONCATENATE(FILIACION_ESTUDIANTE!B36,\"  \",FILIACION_ESTUDIANTE!C36,\"  \",FILIACION_ESTUDIANTE!D36)","v":"    "}]
[30,{"$f":"CONCATENATE(FILIACION_ESTUDIANTE!B37,\"  \",FILIACION_ESTUDIANTE!C37,\"  \",FILIACION_ESTUDIANTE!D37)","v":"    "},null,null,null,null,null,null,null,null,null,null,null,null,null,null,null,null,null,null,"GGGGGGGG"]
[31,{"$f":"CONCATENATE(FILIACION_ESTUDIANTE!B38,\"  \",FILIACION_ESTUDIANTE!C38,\"  \",FILIACION_ESTUDIANTE!D38)","v":"    "}]
[32,{"$f":"CONCATENATE(FILIACION_ESTUDIANTE!B39,\"  \",FILIACION_ESTUDIANTE!C39,\"  \",FILIACION_ESTUDIANTE!D39)","v":"    "}]
[33,{"$f":"CONCATENATE(FILIACION_ESTUDIANTE!B40,\"  \",FILIACION_ESTUDIANTE!C40,\"  \",FILIACION_ESTUDIANTE!D40)","v":"    "},null,null,null,null,null,null,null,null,null,null,null,null,null,null,null,null,null,null,"GGGGGGGG"]
[34,{"$f":"CONCATENATE(FILIACION_ESTUDIANTE!B41,\"  \",FILIACION_ESTUDIANTE!C41,\"  \",FILIACION_ESTUDIANTE!D41)","v":"    "}]
[35,{"$f":"CONCATENATE(FILIACION_ESTUDIANTE!B42,\"  \",FILIACION_ESTUDIANTE!C42,\"  \",FILIACION_ESTUDIANTE!D42)","v":"    "}]
[36,{"$f":"CONCATENATE(FILIACION_ESTUDIANTE!B43,\"  \",FILIACION_ESTUDIANTE!C43,\"  \",FILIACION_ESTUDIANTE!D43)","v":"    "},null,null,null,null,null,null,null,null,null,null,null,null,null,null,null,null,null,null,"GGGGGGGG"]
[37,{"$f":"CONCATENATE(FILIACION_ESTUDIANTE!B44,\"  \",FILIACION_ESTUDIANTE!C44,\"  \",FILIACION_ESTUDIANTE!D44)","v":"    "}]
[38,{"$f":"CONCATENATE(FILIACION_ESTUDIANTE!B45,\"  \",FILIACION_ESTUDIANTE!C45,\"  \",FILIACION_ESTUDIANTE!D45)","v":"    "}]
[39,{"$f":"CONCATENATE(FILIACION_ESTUDIANTE!B46,\"  \",FILIACION_ESTUDIANTE!C46,\"  \",FILIACION_ESTUDIANTE!D46)","v":"    "},null,null,null,null,null,null,null,null,null,null,null,null,null,null,null,null,null,null,"GGGGGGGG"]
[40,{"$f":"CONCATENATE(FILIACION_ESTUDIANTE!B47,\"  \",FILIACION_ESTUDIANTE!C47,\"  \",FILIACION_ESTUDIANTE!D47)","v":"    "}]

{"sheet":"COSMOS_PENS_1B","index":25,"n_rows":53,"n_cols":48,"rows_kept":53,"cut":false,"hidden":false,"merged":[[50,18,50,19],[51,18,51,19],[52,18,52,19],[19,18,19,19],[20,18,20,19],[21,18,21,19],[25,18,25,19],[26,18,26,19],[27,18,27,19],[28,18,28,19],[29,18,29,19],[35,18,35,19],[30,18,30,19],[31,18,31,19],[32,18,32,19],[33,18,33,19],[47,18,47,19],[48,18,48,19],[49,18,49,19],[22,18,22,19],[23,18,23,19],[24,18,24,19],[41,18,41,19],[42,18,42,19],[43,18,43,19],[44,18,44,19],[40,18,40,19],[36,18,36,19],[37,18,37,19],[38,18,38,19],[39,18,39,19],[45,18,45,19],[3,18,3,20],[4,0,4,20],[6,0,12,0],[6,2,6,5],[6,6,6,9],[6,10,6,13],[5,0,5,1],[5,2,5,20],[6,20,12,20],[7,10,9,10],[7,11,9,11],[7,7,9,7],[7,8,9,8],[7,9,9,9],[11,5,12,5],[11,6,12,6],[3,0,3,1],[3,2,3,11],[3,12,3,17],[11,7,12,7],[11,8,12,8],[7,14,9,14],[11,10,12,10],[11,11,12,11],[1,27,6,31],[2,2,2,19],[7,15,9,15],[7,16,9,16],[11,12,12,12],[11,13,12,13],[11,14,12,14],[11,15,12,15],[11,16,12,16],[11,17,12,17],[7,17,9,17],[6,18,8,19],[11,2,12,2],[11,9,12,9],[11,3,12,3],[11,4,12,4],[18,18,18,19],[46,18,46,19],[1,1,2,1],[1,2,1,19],[34,18,34,19],[7,3,9,3],[7,4,9,4],[7,5,9,5],[7,1,9,1],[7,2,9,2],[7,12,9,12],[7,13,9,13],[6,14,6,17],[7,6,9,6],[10,18,10,19],[11,18,12,19],[14,18,14,19],[15,18,15,19],[13,18,13,19],[16,18,16,19],[17,18,17,19]]}
[]
[null,null,"CUADRO DE VALORACIÓN",null,null,null,null,null,null,null,null,null,null,null,null,null,null,null,null,null,null,null,null,null,null,null,null,"REGISTRO DE VALORACION",null,null,null,null,"ED",null,null,null,null,null,null,null,"DA","DO",null,"DP"]
[null,null,"EDUCACIÓN INICIAL  EN FAMILIA COMUNITARIA ",null,null,null,null,null,null,null,null,null,null,null,null,null,null,null,null,null,"1er BIMESTRE"]
[{"$f":"UPPER( CARATULA!$C$20)","v":"MAESTRA (O):"},null,{"$f":"CARATULA!$E$20","v":0},null,null,null,null,null,null,null,null,null,{"$f":"UPPER(CARATULA!$C$21)","v":"AÑO DE ESCOLARIDAD:"},null,null,null,null,null,{"$f":"CARATULA!$E$21","v":0}]
["CAMPO DE SABER Y CONOCIMIENTO -  COSMOS Y PENSAMIENTO"]
["EVALUACIÓN",null,"CRITERIOS DE LAS DIMENSIONES"]
["Nº","DIMENSIONES","SER",null,null,null,"SABER",null,null,null,"HACER",null,null,null,"DECIDIR",null,null,null,"AUTOEVALUACIÓN (SER, SABER, HACER, DECIDIR)",null,"SÍNTESIS CUALITATIVA DEL BIMESTRE"]
[null,"PLANES DE CLASE (PDC)","PDC","PDC","PDC","PDC","PDC","PDC","PDC","PDC","PDC","PDC","PDC","PDC","PDC","PDC","PDC","PDC"]
[null,null,null,null,null,null,null,null,null,null,null,null,null,null,null,null,null,null,null,null,null,null,null,null,null,null,null,"DP","DO","DA","ED"]
[null,null,null,null,null,null,null,null,null,null,null,null,null,null,null,null,null,null,null,null,null,null,null,null,null,null,null,14,8,5,1]
[null,"CRITERIOS DE EVALUACIÓN"]
[null,"INSTRUMENTOS Y/O ESTRATEGIAS DE EVALUACIÓN"]
[null,"APELLIDOS Y NOMBRES"]
[1,{"$f":"CONCATENATE(FILIACION_ESTUDIANTE!B8,\"  \",FILIACION_ESTUDIANTE!C8,\"  \",FILIACION_ESTUDIANTE!D8)","v":"    "},null,null,null,null,null,null,null,null,null,null,null,null,null,null,null,null,null,null,null,null,null,"demuestra  algunas actitudes armonicas etre sfamilia Y  LE FALTAT",null,null,null,{"$f":"IF(C14=$AB$9,$AB$10,IF(C14=$AC$9,$AC$10,IF(C14=$AD$9,$AD$10,IF(C14=$AE$9,$AE$10))))","v":false},{"$f":"IF(D14=$AB$9,$AB$10,IF(D14=$AC$9,$AC$10,IF(D14=$AD$9,$AD$10,IF(D14=$AE$9,$AE$10))))","v":false},{"$f":"IF(E14=$AB$9,$AB$10,IF(E14=$AC$9,$AC$10,IF(E14=$AD$9,$AD$10,IF(E14=$AE$9,$AE$10))))","v":false},{"$f":"IF(F14=$AB$9,$AB$10,IF(F14=$AC$9,$AC$10,IF(F14=$AD$9,$AD$10,IF(F14=$AE$9,$AE$10))))","v":false},{"$f":"SUM(AB14:AE14)","v":0},{"$f":"IF(G14=$AB$9,$AB$10,IF(G14=$AC$9,$AC$10,IF(G14=$AD$9,$AD$10,IF(G14=$AE$9,$AE$10))))","v":false},{"$f":"IF(H14=$AB$9,$AB$10,IF(H14=$AC$9,$AC$10,IF(H14=$AD$9,$AD$10,IF(H14=$AE$9,$AE$10))))","v":false},{"$f":"IF(I14=$AB$9,$AB$10,IF(I14=$AC$9,$AC$10,IF(I14=$AD$9,$AD$10,IF(I14=$AE$9,$AE$10))))","v":false},{"$f":"IF(J14=$AB$9,$AB$10,IF(J14=$AC$9,$AC$10,IF(J14=$AD$9,$AD$10,IF(J14=$AE$9,$AE$10))))","v":false},{"$f":"SUM(AG14:AJ14)","v":0},{"$f":"IF(K14=$AB$9,$AB$10,IF(K14=$AC$9,$AC$10,IF(K14=$AD$9,$AD$10,IF(K14=$AE$9,$AE$10))))","v":false},{"$f":"IF(L14=$AB$9,$AB$10,IF(L14=$AC$9,$AC$10,IF(L14=$AD$9,$AD$10,IF(L14=$AE$9,$AE$10))))","v":false},{"$f":"IF(M14=$AB$9,$AB$10,IF(M14=$AC$9,$AC$10,IF(M14=$AD$9,$AD$10,IF(M14=$AE$9,$AE$10))))","v":false},{"$f":"IF(N14=$AB$9,$AB$10,IF(N14=$AC$9,$AC$10,IF(N14=$AD$9,$AD$10,IF(N14=$AE$9,$AE$10))))","v":false},{"$f":"SUM(AL14:AO14)","v":0},{"$f":"IF(O14=$AB$9,$AB$10,IF(O14=$AC$9,$AC$10,IF(O14=$AD$9,$AD$10,IF(O14=$AE$9,$AE$10))))","v":false},{"$f":"IF(P14=$AB$9,$AB$10,IF(P14=$AC$9,$AC$10,IF(P14=$AD$9,$AD$10,IF(P14=$AE$9,$AE$10))))","v":false},{"$f":"IF(Q14=$AB$9,$AB$10,IF(Q14=$AC$9,$AC$10,IF(Q14=$AD$9,$AD$10,IF(Q14=$AE$9,$AE$10))))","v":false},{"$f":"IF(R14=$AB$9,$AB$10,IF(R14=$AC$9,$AC$10,IF(R14=$AD$9,$AD$10,IF(R14=$AE$9,$AE$10))))","v":false},{"$f":"SUM(AQ14:AT14)","v":0},{"$f":"MAX(AF14,AK14,AP14,AU14)","v":0}]
[2,{"$f":"CONCATENATE(FILIACION_ESTUDIANTE!B9,\"  \",FILIACION_ESTUDIANTE!C9,\"  \",FILIACION_ESTUDIANTE!D9)","v":"    "}]
[3,{"$f":"CONCATENATE(FILIACION_ESTUDIANTE!B10,\"  \",FILIACION_ESTUDIANTE!C10,\"  \",FILIACION_ESTUDIANTE!D10)","v":"    "}]
[4,{"$f":"CONCATENATE(FILIACION_ESTUDIANTE!B11,\"  \",FILIACION_ESTUDIANTE!C11,\"  \",FILIACION_ESTUDIANTE!D11)","v":"    "}]
[5,{"$f":"CONCATENATE(FILIACION_ESTUDIANTE!B12,\"  \",FILIACION_ESTUDIANTE!C12,\"  \",FILIACION_ESTUDIANTE!D12)","v":"    "}]
[6,{"$f":"CONCATENATE(FILIACION_ESTUDIANTE!B13,\"  \",FILIACION_ESTUDIANTE!C13,\"  \",FILIACION_ESTUDIANTE!D13)","v":"    "}]
[7,{"$f":"CONCATENATE(FILIACION_ESTUDIANTE!B14,\"  \",FILIACION_ESTUDIANTE!C14,\"  \",FILIACION_ESTUDIANTE!D14)","v":"    "}]
[8,{"$f":"CONCATENATE(FILIACION_ESTUDIANTE!B15,\"  \",FILIACION_ESTUDIANTE!C15,\"  \",FILIACION_ESTUDIANTE!D15)","v":"    "}]
[9,{"$f":"CONCATENATE(FILIACION_ESTUDIANTE!B16,\"  \",FILIACION_ESTUDIANTE!C16,\"  \",FILIACION_ESTUDIANTE!D16)","v":"    "}]
[10,{"$f":"CONCATENATE(FILIACION_ESTUDIANTE!B17,\"  \",FILIACION_ESTUDIANTE!C17,\"  \",FILIACION_ESTUDIANTE!D17)","v":"    "}]
[11,{"$f":"CONCATENATE(FILIACION_ESTUDIANTE!B18,\"  \",FILIACION_ESTUDIANTE!C18,\"  \",FILIACION_ESTUDIANTE!D18)","v":"    "}]
[12,{"$f":"CONCATENATE(FILIACION_ESTUDIANTE!B19,\"  \",FILIACION_ESTUDIANTE!C19,\"  \",FILIACION_ESTUDIANTE!D19)","v":"    "}]
[13,{"$f":"CONCATENATE(FILIACION_ESTUDIANTE!B20,\"  \",FILIACION_ESTUDIANTE!C20,\"  \",FILIACION_ESTUDIANTE!D20)","v":"    "}]
[14,{"$f":"CONCATENATE(FILIACION_ESTUDIANTE!B21,\"  \",FILIACION_ESTUDIANTE!C21,\"  \",FILIACION_ESTUDIANTE!D21)","v":"    "}]
[15,{"$f":"CONCATENATE(FILIACION_ESTUDIANTE!B22,\"  \",FILIACION_ESTUDIANTE!C22,\"  \",FILIACION_ESTUDIANTE!D22)","v":"    "}]
[16,{"$f":"CONCATENATE(FILIACION_ESTUDIANTE!B23,\"  \",FILIACION_ESTUDIANTE!C23,\"  \",FILIACION_ESTUDIANTE!D23)","v":"    "}]
[17,{"$f":"CONCATENATE(FILIACION_ESTUDIANTE!B24,\"  \",FILIACION_ESTUDIANTE!C24,\"  \",FILIACION_ESTUDIANTE!D24)","v":"    "}]
[18,{"$f":"CONCATENATE(FILIACION_ESTUDIANTE!B25,\"  \",FILIACION_ESTUDIANTE!C25,\"  \",FILIACION_ESTUDIANTE!D25)","v":"    "}]
[19,{"$f":"CONCATENATE(FILIACION_ESTUDIANTE!B26,\"  \",FILIACION_ESTUDIANTE!C26,\"  \",FILIACION_ESTUDIANTE!D26)","v":"    "}]
[20,{"$f":"CONCATENATE(FILIACION_ESTUDIANTE!B27,\"  \",FILIACION_ESTUDIANTE!C27,\"  \",FILIACION_ESTUDIANTE!D27)","v":"    "}]
[21,{"$f":"CONCATENATE(FILIACION_ESTUDIANTE!B28,\"  \",FILIACION_ESTUDIANTE!C28,\"  \",FILIACION_ESTUDIANTE!D28)","v":"    "}]
[22,{"$f":"CONCATENATE(FILIACION_ESTUDIANTE!B29,\"  \",FILIACION_ESTUDIANTE!C29,\"  \",FILIACION_ESTUDIANTE!D29)","v":"    "}]
[23,{"$f":"CONCATENATE(FILIACION_ESTUDIANTE!B30,\"  \",FILIACION_ESTUDIANTE!C30,\"  \",FILIACION_ESTUDIANTE!D30)","v":"    "}]
[24,{"$f":"CONCATENATE(FILIACION_ESTUDIANTE!B31,\"  \",FILIACION_ESTUDIANTE!C31,\"  \",FILIACION_ESTUDIANTE!D31)","v":"    "}]
[25,{"$f":"CONCATENATE(FILIACION_ESTUDIANTE!B32,\"  \",FILIACION_ESTUDIANTE!C32,\"  \",FILIACION_ESTUDIANTE!D32)","v":"    "}]
[26,{"$f":"CONCATENATE(FILIACION_ESTUDIANTE!B33,\"  \",FILIACION_ESTUDIANTE!C33,\"  \",FILIACION_ESTUDIANTE!D33)","v":"    "}]
[27,{"$f":"CONCATENATE(FILIACION_ESTUDIANTE!B34,\"  \",FILIACION_ESTUDIANTE!C34,\"  \",FILIACION_ESTUDIANTE!D34)","v":"    "}]
[28,{"$f":"CONCATENATE(FILIACION_ESTUDIANTE!B35,\"  \",FILIACION_ESTUDIANTE!C35,\"  \",FILIACION_ESTUDIANTE!D35)","v":"    "}]
[29,{"$f":"CONCATENATE(FILIACION_ESTUDIANTE!B36,\"  \",FILIACION_ESTUDIANTE!C36,\"  \",FILIACION_ESTUDIANTE!D36)","v":"    "}]
[30,{"$f":"CONCATENATE(FILIACION_ESTUDIANTE!B37,\"  \",FILIACION_ESTUDIANTE!C37,\"  \",FILIACION_ESTUDIANTE!D37)","v":"    "}]
[31,{"$f":"CONCATENATE(FILIACION_ESTUDIANTE!B38,\"  \",FILIACION_ESTUDIANTE!C38,\"  \",FILIACION_ESTUDIANTE!D38)","v":"    "}]
[32,{"$f":"CONCATENATE(FILIACION_ESTUDIANTE!B39,\"  \",FILIACION_ESTUDIANTE!C39,\"  \",FILIACION_ESTUDIANTE!D39)","v":"    "}]
[33,{"$f":"CONCATENATE(FILIACION_ESTUDIANTE!B40,\"  \",FILIACION_ESTUDIANTE!C40,\"  \",FILIACION_ESTUDIANTE!D40)","v":"    "}]
[34,{"$f":"CONCATENATE(FILIACION_ESTUDIANTE!B41,\"  \",FILIACION_ESTUDIANTE!C41,\"  \",FILIACION_ESTUDIANTE!D41)","v":"    "}]
[35,{"$f":"CONCATENATE(FILIACION_ESTUDIANTE!B42,\"  \",FILIACION_ESTUDIANTE!C42,\"  \",FILIACION_ESTUDIANTE!D42)","v":"    "}]
[36,{"$f":"CONCATENATE(FILIACION_ESTUDIANTE!B43,\"  \",FILIACION_ESTUDIANTE!C43,\"  \",FILIACION_ESTUDIANTE!D43)","v":"    "}]
[37,{"$f":"CONCATENATE(FILIACION_ESTUDIANTE!B44,\"  \",FILIACION_ESTUDIANTE!C44,\"  \",FILIACION_ESTUDIANTE!D44)","v":"    "}]
[38,{"$f":"CONCATENATE(FILIACION_ESTUDIANTE!B45,\"  \",FILIACION_ESTUDIANTE!C45,\"  \",FILIACION_ESTUDIANTE!D45)","v":"    "}]
[39,{"$f":"CONCATENATE(FILIACION_ESTUDIANTE!B46,\"  \",FILIACION_ESTUDIANTE!C46,\"  \",FILIACION_ESTUDIANTE!D46)","v":"    "}]
[40,{"$f":"CONCATENATE(FILIACION_ESTUDIANTE!B47,\"  \",FILIACION_ESTUDIANTE!C47,\"  \",FILIACION_ESTUDIANTE!D47)","v":"    "}]

{"sheet":"COSMOS_PENS_2B","index":26,"n_rows":53,"n_cols":48,"rows_kept":53,"cut":false,"hidden":false,"merged":[[11,14,12,14],[11,7,12,7],[11,8,12,8],[11,9,12,9],[11,10,12,10],[11,11,12,11],[11,2,12,2],[11,3,12,3],[11,4,12,4],[11,5,12,5],[11,6,12,6],[33,18,33,19],[34,18,34,19],[35,18,35,19],[36,18,36,19],[37,18,37,19],[38,18,38,19],[39,18,39,19],[40,18,40,19],[41,18,41,19],[42,18,42,19],[51,18,51,19],[52,18,52,19],[43,18,43,19],[44,18,44,19],[45,18,45,19],[46,18,46,19],[47,18,47,19],[48,18,48,19],[49,18,49,19],[50,18,50,19],[29,18,29,19],[30,18,30,19],[31,18,31,19],[32,18,32,19],[23,18,23,19],[24,18,24,19],[25,18,25,19],[26,18,26,19],[27,18,27,19],[28,18,28,19],[18,18,18,19],[19,18,19,19],[20,18,20,19],[21,18,21,19],[22,18,22,19],[13,18,13,19],[14,18,14,19],[15,18,15,19],[16,18,16,19],[17,18,17,19],[1,1,2,1],[1,2,1,19],[1,27,6,31],[2,2,2,19],[3,0,3,1],[3,2,3,11],[3,12,3,17],[3,18,3,20],[4,0,4,20],[5,0,5,1],[6,0,12,0],[6,2,6,5],[6,6,6,9],[6,10,6,13],[6,14,6,17],[5,2,5,20],[7,6,9,6],[7,7,9,7],[7,8,9,8],[7,9,9,9],[7,10,9,10],[7,1,9,1],[7,2,9,2],[7,3,9,3],[7,4,9,4],[7,5,9,5],[6,18,8,19],[7,11,9,11],[7,12,9,12],[7,14,9,14],[6,20,12,20],[7,13,9,13],[7,15,9,15],[7,16,9,16],[7,17,9,17],[11,15,12,15],[11,16,12,16],[11,17,12,17],[11,18,12,19],[10,18,10,19],[11,12,12,12],[11,13,12,13]]}
[]
[null,null,"CUADRO DE VALORACIÓN",null,null,null,null,null,null,null,null,null,null,null,null,null,null,null,null,null,null,null,null,null,null,null,null,"REGISTRO DE VALORACION",null,null,null,null,"ED",null,null,null,null,null,null,null,"DA","DO",null,"DP"]
[null,null,"EDUCACIÓN INICIAL  EN FAMILIA COMUNITARIA ",null,null,null,null,null,null,null,null,null,null,null,null,null,null,null,null,null,"2° BIMESTRE"]
[{"$f":"UPPER( CARATULA!$C$20)","v":"MAESTRA (O):"},null,{"$f":"CARATULA!$E$20","v":0},null,null,null,null,null,null,null,null,null,{"$f":"UPPER(CARATULA!$C$21)","v":"AÑO DE ESCOLARIDAD:"},null,null,null,null,null,{"$f":"CARATULA!$E$21","v":0}]
["CAMPO DE SABER Y CONOCIMIENTO -  COSMOS Y PENSAMIENTO"]
["EVALUACIÓN",null,"CRITERIOS DE LAS DIMENSIONES"]
["Nº","DIMENSIONES","SER",null,null,null,"SABER",null,null,null,"HACER",null,null,null,"DECIDIR",null,null,null,"AUTOEVALUACIÓN (SER, SABER, HACER, DECIDIR)",null,"SÍNTESIS CUALITATIVA DEL BIMESTRE"]
[null,"PLANES DE CLASE (PDC)","PDC","PDC","PDC","PDC","PDC","PDC","PDC","PDC","PDC","PDC","PDC","PDC","PDC","PDC","PDC","PDC"]
[null,null,null,null,null,null,null,null,null,null,null,null,null,null,null,null,null,null,null,null,null,null,null,null,null,null,null,"DP","DO","DA","ED"]
[null,null,null,null,null,null,null,null,null,null,null,null,null,null,null,null,null,null,null,null,null,null,null,null,null,null,null,14,8,5,1]
[null,"CRITERIOS DE EVALUACIÓN"]
[null,"INSTRUMENTOS Y/O ESTRATEGIAS DE EVALUACIÓN"]
[null,"APELLIDOS Y NOMBRES"]
[1,{"$f":"CONCATENATE(FILIACION_ESTUDIANTE!B8,\"  \",FILIACION_ESTUDIANTE!C8,\"  \",FILIACION_ESTUDIANTE!D8)","v":"    "},null,null,null,null,null,null,null,null,null,null,null,null,null,null,null,null,null,null,null,null,null,"demuestra  algunas actitudes armonicas etre sfamilia Y  LE FALTAT",null,null,null,{"$f":"IF(C14=$AB$9,$AB$10,IF(C14=$AC$9,$AC$10,IF(C14=$AD$9,$AD$10,IF(C14=$AE$9,$AE$10))))","v":false},{"$f":"IF(D14=$AB$9,$AB$10,IF(D14=$AC$9,$AC$10,IF(D14=$AD$9,$AD$10,IF(D14=$AE$9,$AE$10))))","v":false},{"$f":"IF(E14=$AB$9,$AB$10,IF(E14=$AC$9,$AC$10,IF(E14=$AD$9,$AD$10,IF(E14=$AE$9,$AE$10))))","v":false},{"$f":"IF(F14=$AB$9,$AB$10,IF(F14=$AC$9,$AC$10,IF(F14=$AD$9,$AD$10,IF(F14=$AE$9,$AE$10))))","v":false},{"$f":"SUM(AB14:AE14)","v":0},{"$f":"IF(G14=$AB$9,$AB$10,IF(G14=$AC$9,$AC$10,IF(G14=$AD$9,$AD$10,IF(G14=$AE$9,$AE$10))))","v":false},{"$f":"IF(H14=$AB$9,$AB$10,IF(H14=$AC$9,$AC$10,IF(H14=$AD$9,$AD$10,IF(H14=$AE$9,$AE$10))))","v":false},{"$f":"IF(I14=$AB$9,$AB$10,IF(I14=$AC$9,$AC$10,IF(I14=$AD$9,$AD$10,IF(I14=$AE$9,$AE$10))))","v":false},{"$f":"IF(J14=$AB$9,$AB$10,IF(J14=$AC$9,$AC$10,IF(J14=$AD$9,$AD$10,IF(J14=$AE$9,$AE$10))))","v":false},{"$f":"SUM(AG14:AJ14)","v":0},{"$f":"IF(K14=$AB$9,$AB$10,IF(K14=$AC$9,$AC$10,IF(K14=$AD$9,$AD$10,IF(K14=$AE$9,$AE$10))))","v":false},{"$f":"IF(L14=$AB$9,$AB$10,IF(L14=$AC$9,$AC$10,IF(L14=$AD$9,$AD$10,IF(L14=$AE$9,$AE$10))))","v":false},{"$f":"IF(M14=$AB$9,$AB$10,IF(M14=$AC$9,$AC$10,IF(M14=$AD$9,$AD$10,IF(M14=$AE$9,$AE$10))))","v":false},{"$f":"IF(N14=$AB$9,$AB$10,IF(N14=$AC$9,$AC$10,IF(N14=$AD$9,$AD$10,IF(N14=$AE$9,$AE$10))))","v":false},{"$f":"SUM(AL14:AO14)","v":0},{"$f":"IF(O14=$AB$9,$AB$10,IF(O14=$AC$9,$AC$10,IF(O14=$AD$9,$AD$10,IF(O14=$AE$9,$AE$10))))","v":false},{"$f":"IF(P14=$AB$9,$AB$10,IF(P14=$AC$9,$AC$10,IF(P14=$AD$9,$AD$10,IF(P14=$AE$9,$AE$10))))","v":false},{"$f":"IF(Q14=$AB$9,$AB$10,IF(Q14=$AC$9,$AC$10,IF(Q14=$AD$9,$AD$10,IF(Q14=$AE$9,$AE$10))))","v":false},{"$f":"IF(R14=$AB$9,$AB$10,IF(R14=$AC$9,$AC$10,IF(R14=$AD$9,$AD$10,IF(R14=$AE$9,$AE$10))))","v":false},{"$f":"SUM(AQ14:AT14)","v":0},{"$f":"MAX(AF14,AK14,AP14,AU14)","v":0}]
[2,{"$f":"CONCATENATE(FILIACION_ESTUDIANTE!B9,\"  \",FILIACION_ESTUDIANTE!C9,\"  \",FILIACION_ESTUDIANTE!D9)","v":"    "}]
[3,{"$f":"CONCATENATE(FILIACION_ESTUDIANTE!B10,\"  \",FILIACION_ESTUDIANTE!C10,\"  \",FILIACION_ESTUDIANTE!D10)","v":"    "}]
[4,{"$f":"CONCATENATE(FILIACION_ESTUDIANTE!B11,\"  \",FILIACION_ESTUDIANTE!C11,\"  \",FILIACION_ESTUDIANTE!D11)","v":"    "}]
[5,{"$f":"CONCATENATE(FILIACION_ESTUDIANTE!B12,\"  \",FILIACION_ESTUDIANTE!C12,\"  \",FILIACION_ESTUDIANTE!D12)","v":"    "}]
[6,{"$f":"CONCATENATE(FILIACION_ESTUDIANTE!B13,\"  \",FILIACION_ESTUDIANTE!C13,\"  \",FILIACION_ESTUDIANTE!D13)","v":"    "}]
[7,{"$f":"CONCATENATE(FILIACION_ESTUDIANTE!B14,\"  \",FILIACION_ESTUDIANTE!C14,\"  \",FILIACION_ESTUDIANTE!D14)","v":"    "}]
[8,{"$f":"CONCATENATE(FILIACION_ESTUDIANTE!B15,\"  \",FILIACION_ESTUDIANTE!C15,\"  \",FILIACION_ESTUDIANTE!D15)","v":"    "}]
[9,{"$f":"CONCATENATE(FILIACION_ESTUDIANTE!B16,\"  \",FILIACION_ESTUDIANTE!C16,\"  \",FILIACION_ESTUDIANTE!D16)","v":"    "}]
[10,{"$f":"CONCATENATE(FILIACION_ESTUDIANTE!B17,\"  \",FILIACION_ESTUDIANTE!C17,\"  \",FILIACION_ESTUDIANTE!D17)","v":"    "}]
[11,{"$f":"CONCATENATE(FILIACION_ESTUDIANTE!B18,\"  \",FILIACION_ESTUDIANTE!C18,\"  \",FILIACION_ESTUDIANTE!D18)","v":"    "}]
[12,{"$f":"CONCATENATE(FILIACION_ESTUDIANTE!B19,\"  \",FILIACION_ESTUDIANTE!C19,\"  \",FILIACION_ESTUDIANTE!D19)","v":"    "}]
[13,{"$f":"CONCATENATE(FILIACION_ESTUDIANTE!B20,\"  \",FILIACION_ESTUDIANTE!C20,\"  \",FILIACION_ESTUDIANTE!D20)","v":"    "}]
[14,{"$f":"CONCATENATE(FILIACION_ESTUDIANTE!B21,\"  \",FILIACION_ESTUDIANTE!C21,\"  \",FILIACION_ESTUDIANTE!D21)","v":"    "}]
[15,{"$f":"CONCATENATE(FILIACION_ESTUDIANTE!B22,\"  \",FILIACION_ESTUDIANTE!C22,\"  \",FILIACION_ESTUDIANTE!D22)","v":"    "}]
[16,{"$f":"CONCATENATE(FILIACION_ESTUDIANTE!B23,\"  \",FILIACION_ESTUDIANTE!C23,\"  \",FILIACION_ESTUDIANTE!D23)","v":"    "}]
[17,{"$f":"CONCATENATE(FILIACION_ESTUDIANTE!B24,\"  \",FILIACION_ESTUDIANTE!C24,\"  \",FILIACION_ESTUDIANTE!D24)","v":"    "}]
[18,{"$f":"CONCATENATE(FILIACION_ESTUDIANTE!B25,\"  \",FILIACION_ESTUDIANTE!C25,\"  \",FILIACION_ESTUDIANTE!D25)","v":"    "}]
[19,{"$f":"CONCATENATE(FILIACION_ESTUDIANTE!B26,\"  \",FILIACION_ESTUDIANTE!C26,\"  \",FILIACION_ESTUDIANTE!D26)","v":"    "}]
[20,{"$f":"CONCATENATE(FILIACION_ESTUDIANTE!B27,\"  \",FILIACION_ESTUDIANTE!C27,\"  \",FILIACION_ESTUDIANTE!D27)","v":"    "}]
[21,{"$f":"CONCATENATE(FILIACION_ESTUDIANTE!B28,\"  \",FILIACION_ESTUDIANTE!C28,\"  \",FILIACION_ESTUDIANTE!D28)","v":"    "}]
[22,{"$f":"CONCATENATE(FILIACION_ESTUDIANTE!B29,\"  \",FILIACION_ESTUDIANTE!C29,\"  \",FILIACION_ESTUDIANTE!D29)","v":"    "}]
[23,{"$f":"CONCATENATE(FILIACION_ESTUDIANTE!B30,\"  \",FILIACION_ESTUDIANTE!C30,\"  \",FILIACION_ESTUDIANTE!D30)","v":"    "}]
[24,{"$f":"CONCATENATE(FILIACION_ESTUDIANTE!B31,\"  \",FILIACION_ESTUDIANTE!C31,\"  \",FILIACION_ESTUDIANTE!D31)","v":"    "}]
[25,{"$f":"CONCATENATE(FILIACION_ESTUDIANTE!B32,\"  \",FILIACION_ESTUDIANTE!C32,\"  \",FILIACION_ESTUDIANTE!D32)","v":"    "}]
[26,{"$f":"CONCATENATE(FILIACION_ESTUDIANTE!B33,\"  \",FILIACION_ESTUDIANTE!C33,\"  \",FILIACION_ESTUDIANTE!D33)","v":"    "}]
[27,{"$f":"CONCATENATE(FILIACION_ESTUDIANTE!B34,\"  \",FILIACION_ESTUDIANTE!C34,\"  \",FILIACION_ESTUDIANTE!D34)","v":"    "}]
[28,{"$f":"CONCATENATE(FILIACION_ESTUDIANTE!B35,\"  \",FILIACION_ESTUDIANTE!C35,\"  \",FILIACION_ESTUDIANTE!D35)","v":"    "}]
[29,{"$f":"CONCATENATE(FILIACION_ESTUDIANTE!B36,\"  \",FILIACION_ESTUDIANTE!C36,\"  \",FILIACION_ESTUDIANTE!D36)","v":"    "}]
[30,{"$f":"CONCATENATE(FILIACION_ESTUDIANTE!B37,\"  \",FILIACION_ESTUDIANTE!C37,\"  \",FILIACION_ESTUDIANTE!D37)","v":"    "}]
[31,{"$f":"CONCATENATE(FILIACION_ESTUDIANTE!B38,\"  \",FILIACION_ESTUDIANTE!C38,\"  \",FILIACION_ESTUDIANTE!D38)","v":"    "}]
[32,{"$f":"CONCATENATE(FILIACION_ESTUDIANTE!B39,\"  \",FILIACION_ESTUDIANTE!C39,\"  \",FILIACION_ESTUDIANTE!D39)","v":"    "}]
[33,{"$f":"CONCATENATE(FILIACION_ESTUDIANTE!B40,\"  \",FILIACION_ESTUDIANTE!C40,\"  \",FILIACION_ESTUDIANTE!D40)","v":"    "}]
[34,{"$f":"CONCATENATE(FILIACION_ESTUDIANTE!B41,\"  \",FILIACION_ESTUDIANTE!C41,\"  \",FILIACION_ESTUDIANTE!D41)","v":"    "}]
[35,{"$f":"CONCATENATE(FILIACION_ESTUDIANTE!B42,\"  \",FILIACION_ESTUDIANTE!C42,\"  \",FILIACION_ESTUDIANTE!D42)","v":"    "}]
[36,{"$f":"CONCATENATE(FILIACION_ESTUDIANTE!B43,\"  \",FILIACION_ESTUDIANTE!C43,\"  \",FILIACION_ESTUDIANTE!D43)","v":"    "}]
[37,{"$f":"CONCATENATE(FILIACION_ESTUDIANTE!B44,\"  \",FILIACION_ESTUDIANTE!C44,\"  \",FILIACION_ESTUDIANTE!D44)","v":"    "}]
[38,{"$f":"CONCATENATE(FILIACION_ESTUDIANTE!B45,\"  \",FILIACION_ESTUDIANTE!C45,\"  \",FILIACION_ESTUDIANTE!D45)","v":"    "}]
[39,{"$f":"CONCATENATE(FILIACION_ESTUDIANTE!B46,\"  \",FILIACION_ESTUDIANTE!C46,\"  \",FILIACION_ESTUDIANTE!D46)","v":"    "}]
[40,{"$f":"CONCATENATE(FILIACION_ESTUDIANTE!B47,\"  \",FILIACION_ESTUDIANTE!C47,\"  \",FILIACION_ESTUDIANTE!D47)","v":"    "}]

{"sheet":"COSMOS_PENS_3B","index":27,"n_rows":53,"n_cols":48,"rows_kept":53,"cut":false,"hidden":false,"merged":[[11,14,12,14],[11,7,12,7],[11,8,12,8],[11,9,12,9],[11,10,12,10],[11,11,12,11],[11,2,12,2],[11,3,12,3],[11,4,12,4],[11,5,12,5],[11,6,12,6],[33,18,33,19],[34,18,34,19],[35,18,35,19],[36,18,36,19],[37,18,37,19],[38,18,38,19],[39,18,39,19],[40,18,40,19],[41,18,41,19],[42,18,42,19],[51,18,51,19],[52,18,52,19],[43,18,43,19],[44,18,44,19],[45,18,45,19],[46,18,46,19],[47,18,47,19],[48,18,48,19],[49,18,49,19],[50,18,50,19],[29,18,29,19],[30,18,30,19],[31,18,31,19],[32,18,32,19],[23,18,23,19],[24,18,24,19],[25,18,25,19],[26,18,26,19],[27,18,27,19],[28,18,28,19],[18,18,18,19],[19,18,19,19],[20,18,20,19],[21,18,21,19],[22,18,22,19],[13,18,13,19],[14,18,14,19],[15,18,15,19],[16,18,16,19],[17,18,17,19],[1,1,2,1],[1,2,1,19],[1,27,6,31],[2,2,2,19],[3,0,3,1],[3,2,3,11],[3,12,3,17],[3,18,3,20],[4,0,4,20],[5,0,5,1],[6,0,12,0],[6,2,6,5],[6,6,6,9],[6,10,6,13],[6,14,6,17],[5,2,5,20],[7,6,9,6],[7,7,9,7],[7,8,9,8],[7,9,9,9],[7,10,9,10],[7,1,9,1],[7,2,9,2],[7,3,9,3],[7,4,9,4],[7,5,9,5],[6,18,8,19],[7,11,9,11],[7,12,9,12],[7,14,9,14],[6,20,12,20],[7,13,9,13],[7,15,9,15],[7,16,9,16],[7,17,9,17],[11,15,12,15],[11,16,12,16],[11,17,12,17],[11,18,12,19],[10,18,10,19],[11,12,12,12],[11,13,12,13]]}
[]
[null,null,"CUADRO DE VALORACIÓN",null,null,null,null,null,null,null,null,null,null,null,null,null,null,null,null,null,null,null,null,null,null,null,null,"REGISTRO DE VALORACION",null,null,null,null,"ED",null,null,null,null,null,null,null,"DA","DO",null,"DP"]
[null,null,"EDUCACIÓN INICIAL  EN FAMILIA COMUNITARIA ",null,null,null,null,null,null,null,null,null,null,null,null,null,null,null,null,null,"3er BIMESTRE"]
[{"$f":"UPPER( CARATULA!$C$20)","v":"MAESTRA (O):"},null,{"$f":"CARATULA!$E$20","v":0},null,null,null,null,null,null,null,null,null,{"$f":"UPPER(CARATULA!$C$21)","v":"AÑO DE ESCOLARIDAD:"},null,null,null,null,null,{"$f":"CARATULA!$E$21","v":0}]
["CAMPO DE SABER Y CONOCIMIENTO -  COSMOS Y PENSAMIENTO"]
["EVALUACIÓN",null,"CRITERIOS DE LAS DIMENSIONES"]
["Nº","DIMENSIONES","SER",null,null,null,"SABER",null,null,null,"HACER",null,null,null,"DECIDIR",null,null,null,"AUTOEVALUACIÓN (SER, SABER, HACER, DECIDIR)",null,"SÍNTESIS CUALITATIVA DEL BIMESTRE"]
[null,"PLANES DE CLASE (PDC)","PDC","PDC","PDC","PDC","PDC","PDC","PDC","PDC","PDC","PDC","PDC","PDC","PDC","PDC","PDC","PDC"]
[null,null,null,null,null,null,null,null,null,null,null,null,null,null,null,null,null,null,null,null,null,null,null,null,null,null,null,"DP","DO","DA","ED"]
[null,null,null,null,null,null,null,null,null,null,null,null,null,null,null,null,null,null,null,null,null,null,null,null,null,null,null,14,8,5,1]
[null,"CRITERIOS DE EVALUACIÓN"]
[null,"INSTRUMENTOS Y/O ESTRATEGIAS DE EVALUACIÓN"]
[null,"APELLIDOS Y NOMBRES"]
[1,{"$f":"CONCATENATE(FILIACION_ESTUDIANTE!B8,\"  \",FILIACION_ESTUDIANTE!C8,\"  \",FILIACION_ESTUDIANTE!D8)","v":"    "},null,null,null,null,null,null,null,null,null,null,null,null,null,null,null,null,null,null,null,null,null,"demuestra  algunas actitudes armonicas etre sfamilia Y  LE FALTAT",null,null,null,{"$f":"IF(C14=$AB$9,$AB$10,IF(C14=$AC$9,$AC$10,IF(C14=$AD$9,$AD$10,IF(C14=$AE$9,$AE$10))))","v":false},{"$f":"IF(D14=$AB$9,$AB$10,IF(D14=$AC$9,$AC$10,IF(D14=$AD$9,$AD$10,IF(D14=$AE$9,$AE$10))))","v":false},{"$f":"IF(E14=$AB$9,$AB$10,IF(E14=$AC$9,$AC$10,IF(E14=$AD$9,$AD$10,IF(E14=$AE$9,$AE$10))))","v":false},{"$f":"IF(F14=$AB$9,$AB$10,IF(F14=$AC$9,$AC$10,IF(F14=$AD$9,$AD$10,IF(F14=$AE$9,$AE$10))))","v":false},{"$f":"SUM(AB14:AE14)","v":0},{"$f":"IF(G14=$AB$9,$AB$10,IF(G14=$AC$9,$AC$10,IF(G14=$AD$9,$AD$10,IF(G14=$AE$9,$AE$10))))","v":false},{"$f":"IF(H14=$AB$9,$AB$10,IF(H14=$AC$9,$AC$10,IF(H14=$AD$9,$AD$10,IF(H14=$AE$9,$AE$10))))","v":false},{"$f":"IF(I14=$AB$9,$AB$10,IF(I14=$AC$9,$AC$10,IF(I14=$AD$9,$AD$10,IF(I14=$AE$9,$AE$10))))","v":false},{"$f":"IF(J14=$AB$9,$AB$10,IF(J14=$AC$9,$AC$10,IF(J14=$AD$9,$AD$10,IF(J14=$AE$9,$AE$10))))","v":false},{"$f":"SUM(AG14:AJ14)","v":0},{"$f":"IF(K14=$AB$9,$AB$10,IF(K14=$AC$9,$AC$10,IF(K14=$AD$9,$AD$10,IF(K14=$AE$9,$AE$10))))","v":false},{"$f":"IF(L14=$AB$9,$AB$10,IF(L14=$AC$9,$AC$10,IF(L14=$AD$9,$AD$10,IF(L14=$AE$9,$AE$10))))","v":false},{"$f":"IF(M14=$AB$9,$AB$10,IF(M14=$AC$9,$AC$10,IF(M14=$AD$9,$AD$10,IF(M14=$AE$9,$AE$10))))","v":false},{"$f":"IF(N14=$AB$9,$AB$10,IF(N14=$AC$9,$AC$10,IF(N14=$AD$9,$AD$10,IF(N14=$AE$9,$AE$10))))","v":false},{"$f":"SUM(AL14:AO14)","v":0},{"$f":"IF(O14=$AB$9,$AB$10,IF(O14=$AC$9,$AC$10,IF(O14=$AD$9,$AD$10,IF(O14=$AE$9,$AE$10))))","v":false},{"$f":"IF(P14=$AB$9,$AB$10,IF(P14=$AC$9,$AC$10,IF(P14=$AD$9,$AD$10,IF(P14=$AE$9,$AE$10))))","v":false},{"$f":"IF(Q14=$AB$9,$AB$10,IF(Q14=$AC$9,$AC$10,IF(Q14=$AD$9,$AD$10,IF(Q14=$AE$9,$AE$10))))","v":false},{"$f":"IF(R14=$AB$9,$AB$10,IF(R14=$AC$9,$AC$10,IF(R14=$AD$9,$AD$10,IF(R14=$AE$9,$AE$10))))","v":false},{"$f":"SUM(AQ14:AT14)","v":0},{"$f":"MAX(AF14,AK14,AP14,AU14)","v":0}]
[2,{"$f":"CONCATENATE(FILIACION_ESTUDIANTE!B9,\"  \",FILIACION_ESTUDIANTE!C9,\"  \",FILIACION_ESTUDIANTE!D9)","v":"    "}]
[3,{"$f":"CONCATENATE(FILIACION_ESTUDIANTE!B10,\"  \",FILIACION_ESTUDIANTE!C10,\"  \",FILIACION_ESTUDIANTE!D10)","v":"    "}]
[4,{"$f":"CONCATENATE(FILIACION_ESTUDIANTE!B11,\"  \",FILIACION_ESTUDIANTE!C11,\"  \",FILIACION_ESTUDIANTE!D11)","v":"    "}]
[5,{"$f":"CONCATENATE(FILIACION_ESTUDIANTE!B12,\"  \",FILIACION_ESTUDIANTE!C12,\"  \",FILIACION_ESTUDIANTE!D12)","v":"    "}]
[6,{"$f":"CONCATENATE(FILIACION_ESTUDIANTE!B13,\"  \",FILIACION_ESTUDIANTE!C13,\"  \",FILIACION_ESTUDIANTE!D13)","v":"    "}]
[7,{"$f":"CONCATENATE(FILIACION_ESTUDIANTE!B14,\"  \",FILIACION_ESTUDIANTE!C14,\"  \",FILIACION_ESTUDIANTE!D14)","v":"    "}]
[8,{"$f":"CONCATENATE(FILIACION_ESTUDIANTE!B15,\"  \",FILIACION_ESTUDIANTE!C15,\"  \",FILIACION_ESTUDIANTE!D15)","v":"    "}]
[9,{"$f":"CONCATENATE(FILIACION_ESTUDIANTE!B16,\"  \",FILIACION_ESTUDIANTE!C16,\"  \",FILIACION_ESTUDIANTE!D16)","v":"    "}]
[10,{"$f":"CONCATENATE(FILIACION_ESTUDIANTE!B17,\"  \",FILIACION_ESTUDIANTE!C17,\"  \",FILIACION_ESTUDIANTE!D17)","v":"    "}]
[11,{"$f":"CONCATENATE(FILIACION_ESTUDIANTE!B18,\"  \",FILIACION_ESTUDIANTE!C18,\"  \",FILIACION_ESTUDIANTE!D18)","v":"    "}]
[12,{"$f":"CONCATENATE(FILIACION_ESTUDIANTE!B19,\"  \",FILIACION_ESTUDIANTE!C19,\"  \",FILIACION_ESTUDIANTE!D19)","v":"    "}]
[13,{"$f":"CONCATENATE(FILIACION_ESTUDIANTE!B20,\"  \",FILIACION_ESTUDIANTE!C20,\"  \",FILIACION_ESTUDIANTE!D20)","v":"    "}]
[14,{"$f":"CONCATENATE(FILIACION_ESTUDIANTE!B21,\"  \",FILIACION_ESTUDIANTE!C21,\"  \",FILIACION_ESTUDIANTE!D21)","v":"    "}]
[15,{"$f":"CONCATENATE(FILIACION_ESTUDIANTE!B22,\"  \",FILIACION_ESTUDIANTE!C22,\"  \",FILIACION_ESTUDIANTE!D22)","v":"    "}]
[16,{"$f":"CONCATENATE(FILIACION_ESTUDIANTE!B23,\"  \",FILIACION_ESTUDIANTE!C23,\"  \",FILIACION_ESTUDIANTE!D23)","v":"    "}]
[17,{"$f":"CONCATENATE(FILIACION_ESTUDIANTE!B24,\"  \",FILIACION_ESTUDIANTE!C24,\"  \",FILIACION_ESTUDIANTE!D24)","v":"    "}]
[18,{"$f":"CONCATENATE(FILIACION_ESTUDIANTE!B25,\"  \",FILIACION_ESTUDIANTE!C25,\"  \",FILIACION_ESTUDIANTE!D25)","v":"    "}]
[19,{"$f":"CONCATENATE(FILIACION_ESTUDIANTE!B26,\"  \",FILIACION_ESTUDIANTE!C26,\"  \",FILIACION_ESTUDIANTE!D26)","v":"    "}]
[20,{"$f":"CONCATENATE(FILIACION_ESTUDIANTE!B27,\"  \",FILIACION_ESTUDIANTE!C27,\"  \",FILIACION_ESTUDIANTE!D27)","v":"    "}]
[21,{"$f":"CONCATENATE(FILIACION_ESTUDIANTE!B28,\"  \",FILIACION_ESTUDIANTE!C28,\"  \",FILIACION_ESTUDIANTE!D28)","v":"    "}]
[22,{"$f":"CONCATENATE(FILIACION_ESTUDIANTE!B29,\"  \",FILIACION_ESTUDIANTE!C29,\"  \",FILIACION_ESTUDIANTE!D29)","v":"    "}]
[23,{"$f":"CONCATENATE(FILIACION_ESTUDIANTE!B30,\"  \",FILIACION_ESTUDIANTE!C30,\"  \",FILIACION_ESTUDIANTE!D30)","v":"    "}]
[24,{"$f":"CONCATENATE(FILIACION_ESTUDIANTE!B31,\"  \",FILIACION_ESTUDIANTE!C31,\"  \",FILIACION_ESTUDIANTE!D31)","v":"    "}]
[25,{"$f":"CONCATENATE(FILIACION_ESTUDIANTE!B32,\"  \",FILIACION_ESTUDIANTE!C32,\"  \",FILIACION_ESTUDIANTE!D32)","v":"    "}]
[26,{"$f":"CONCATENATE(FILIACION_ESTUDIANTE!B33,\"  \",FILIACION_ESTUDIANTE!C33,\"  \",FILIACION_ESTUDIANTE!D33)","v":"    "}]
[27,{"$f":"CONCATENATE(FILIACION_ESTUDIANTE!B34,\"  \",FILIACION_ESTUDIANTE!C34,\"  \",FILIACION_ESTUDIANTE!D34)","v":"    "}]
[28,{"$f":"CONCATENATE(FILIACION_ESTUDIANTE!B35,\"  \",FILIACION_ESTUDIANTE!C35,\"  \",FILIACION_ESTUDIANTE!D35)","v":"    "}]
[29,{"$f":"CONCATENATE(FILIACION_ESTUDIANTE!B36,\"  \",FILIACION_ESTUDIANTE!C36,\"  \",FILIACION_ESTUDIANTE!D36)","v":"    "}]
[30,{"$f":"CONCATENATE(FILIACION_ESTUDIANTE!B37,\"  \",FILIACION_ESTUDIANTE!C37,\"  \",FILIACION_ESTUDIANTE!D37)","v":"    "}]
[31,{"$f":"CONCATENATE(FILIACION_ESTUDIANTE!B38,\"  \",FILIACION_ESTUDIANTE!C38,\"  \",FILIACION_ESTUDIANTE!D38)","v":"    "}]
[32,{"$f":"CONCATENATE(FILIACION_ESTUDIANTE!B39,\"  \",FILIACION_ESTUDIANTE!C39,\"  \",FILIACION_ESTUDIANTE!D39)","v":"    "}]
[33,{"$f":"CONCATENATE(FILIACION_ESTUDIANTE!B40,\"  \",FILIACION_ESTUDIANTE!C40,\"  \",FILIACION_ESTUDIANTE!D40)","v":"    "}]
[34,{"$f":"CONCATENATE(FILIACION_ESTUDIANTE!B41,\"  \",FILIACION_ESTUDIANTE!C41,\"  \",FILIACION_ESTUDIANTE!D41)","v":"    "}]
[35,{"$f":"CONCATENATE(FILIACION_ESTUDIANTE!B42,\"  \",FILIACION_ESTUDIANTE!C42,\"  \",FILIACION_ESTUDIANTE!D42)","v":"    "}]
[36,{"$f":"CONCATENATE(FILIACION_ESTUDIANTE!B43,\"  \",FILIACION_ESTUDIANTE!C43,\"  \",FILIACION_ESTUDIANTE!D43)","v":"    "}]
[37,{"$f":"CONCATENATE(FILIACION_ESTUDIANTE!B44,\"  \",FILIACION_ESTUDIANTE!C44,\"  \",FILIACION_ESTUDIANTE!D44)","v":"    "}]
[38,{"$f":"CONCATENATE(FILIACION_ESTUDIANTE!B45,\"  \",FILIACION_ESTUDIANTE!C45,\"  \",FILIACION_ESTUDIANTE!D45)","v":"    "}]
[39,{"$f":"CONCATENATE(FILIACION_ESTUDIANTE!B46,\"  \",FILIACION_ESTUDIANTE!C46,\"  \",FILIACION_ESTUDIANTE!D46)","v":"    "}]
[40,{"$f":"CONCATENATE(FILIACION_ESTUDIANTE!B47,\"  \",FILIACION_ESTUDIANTE!C47,\"  \",FILIACION_ESTUDIANTE!D47)","v":"    "}]

{"sheet":"COSMOS_PENS_4B","index":28,"n_rows":53,"n_cols":48,"rows_kept":53,"cut":false,"hidden":false,"merged":[[11,14,12,14],[11,7,12,7],[11,8,12,8],[11,9,12,9],[11,10,12,10],[11,11,12,11],[11,2,12,2],[11,3,12,3],[11,4,12,4],[11,5,12,5],[11,6,12,6],[33,18,33,19],[34,18,34,19],[35,18,35,19],[36,18,36,19],[37,18,37,19],[38,18,38,19],[39,18,39,19],[40,18,40,19],[41,18,41,19],[42,18,42,19],[51,18,51,19],[52,18,52,19],[43,18,43,19],[44,18,44,19],[45,18,45,19],[46,18,46,19],[47,18,47,19],[48,18,48,19],[49,18,49,19],[50,18,50,19],[29,18,29,19],[30,18,30,19],[31,18,31,19],[32,18,32,19],[23,18,23,19],[24,18,24,19],[25,18,25,19],[26,18,26,19],[27,18,27,19],[28,18,28,19],[18,18,18,19],[19,18,19,19],[20,18,20,19],[21,18,21,19],[22,18,22,19],[13,18,13,19],[14,18,14,19],[15,18,15,19],[16,18,16,19],[17,18,17,19],[1,1,2,1],[1,2,1,19],[1,27,6,31],[2,2,2,19],[3,0,3,1],[3,2,3,11],[3,18,3,20],[4,0,4,20],[5,0,5,1],[6,0,12,0],[6,2,6,5],[6,6,6,9],[6,10,6,13],[6,14,6,17],[5,2,5,20],[7,6,9,6],[7,7,9,7],[7,8,9,8],[7,9,9,9],[7,10,9,10],[7,1,9,1],[7,2,9,2],[7,3,9,3],[7,4,9,4],[7,5,9,5],[6,18,8,19],[7,11,9,11],[7,12,9,12],[7,14,9,14],[6,20,12,20],[7,13,9,13],[7,15,9,15],[7,16,9,16],[7,17,9,17],[11,15,12,15],[11,16,12,16],[11,17,12,17],[11,18,12,19],[10,18,10,19],[11,12,12,12],[11,13,12,13]]}
[]
[null,null,"CUADRO DE VALORACIÓN",null,null,null,null,null,null,null,null,null,null,null,null,null,null,null,null,null,null,null,null,null,null,null,null,"REGISTRO DE VALORACION",null,null,null,null,"ED",null,null,null,null,null,null,null,"DA","DO",null,"DP"]
[null,null,"EDUCACIÓN INICIAL  EN FAMILIA COMUNITARIA ",null,null,null,null,null,null,null,null,null,null,null,null,null,null,null,null,null,"4° BIMESTRE"]
[{"$f":"UPPER( CARATULA!$C$20)","v":"MAESTRA (O):"},null,{"$f":"CARATULA!$E$20","v":0},null,null,null,null,null,null,null,null,null,{"$f":"UPPER(CARATULA!$C$21)","v":"AÑO DE ESCOLARIDAD:"},null,null,null,null,null,{"$f":"CARATULA!$E$21","v":0}]
["CAMPO DE SABER Y CONOCIMIENTO -  COSMOS Y PENSAMIENTO"]
["EVALUACIÓN",null,"CRITERIOS DE LAS DIMENSIONES"]
["Nº","DIMENSIONES","SER",null,null,null,"SABER",null,null,null,"HACER",null,null,null,"DECIDIR",null,null,null,"AUTOEVALUACIÓN (SER, SABER, HACER, DECIDIR)",null,"SÍNTESIS CUALITATIVA DEL BIMESTRE"]
[null,"PLANES DE CLASE (PDC)","PDC","PDC","PDC","PDC","PDC","PDC","PDC","PDC","PDC","PDC","PDC","PDC","PDC","PDC","PDC","PDC"]
[null,null,null,null,null,null,null,null,null,null,null,null,null,null,null,null,null,null,null,null,null,null,null,null,null,null,null,"DP","DO","DA","ED"]
[null,null,null,null,null,null,null,null,null,null,null,null,null,null,null,null,null,null,null,null,null,null,null,null,null,null,null,14,8,5,1]
[null,"CRITERIOS DE EVALUACIÓN"]
[null,"INSTRUMENTOS Y/O ESTRATEGIAS DE EVALUACIÓN"]
[null,"APELLIDOS Y NOMBRES"]
[1,{"$f":"CONCATENATE(FILIACION_ESTUDIANTE!B8,\"  \",FILIACION_ESTUDIANTE!C8,\"  \",FILIACION_ESTUDIANTE!D8)","v":"    "},null,null,null,null,null,null,null,null,null,null,null,null,null,null,null,null,null,null,null,null,null,"demuestra  algunas actitudes armonicas etre sfamilia Y  LE FALTAT",null,null,null,{"$f":"IF(C14=$AB$9,$AB$10,IF(C14=$AC$9,$AC$10,IF(C14=$AD$9,$AD$10,IF(C14=$AE$9,$AE$10))))","v":false},{"$f":"IF(D14=$AB$9,$AB$10,IF(D14=$AC$9,$AC$10,IF(D14=$AD$9,$AD$10,IF(D14=$AE$9,$AE$10))))","v":false},{"$f":"IF(E14=$AB$9,$AB$10,IF(E14=$AC$9,$AC$10,IF(E14=$AD$9,$AD$10,IF(E14=$AE$9,$AE$10))))","v":false},{"$f":"IF(F14=$AB$9,$AB$10,IF(F14=$AC$9,$AC$10,IF(F14=$AD$9,$AD$10,IF(F14=$AE$9,$AE$10))))","v":false},{"$f":"SUM(AB14:AE14)","v":0},{"$f":"IF(G14=$AB$9,$AB$10,IF(G14=$AC$9,$AC$10,IF(G14=$AD$9,$AD$10,IF(G14=$AE$9,$AE$10))))","v":false},{"$f":"IF(H14=$AB$9,$AB$10,IF(H14=$AC$9,$AC$10,IF(H14=$AD$9,$AD$10,IF(H14=$AE$9,$AE$10))))","v":false},{"$f":"IF(I14=$AB$9,$AB$10,IF(I14=$AC$9,$AC$10,IF(I14=$AD$9,$AD$10,IF(I14=$AE$9,$AE$10))))","v":false},{"$f":"IF(J14=$AB$9,$AB$10,IF(J14=$AC$9,$AC$10,IF(J14=$AD$9,$AD$10,IF(J14=$AE$9,$AE$10))))","v":false},{"$f":"SUM(AG14:AJ14)","v":0},{"$f":"IF(K14=$AB$9,$AB$10,IF(K14=$AC$9,$AC$10,IF(K14=$AD$9,$AD$10,IF(K14=$AE$9,$AE$10))))","v":false},{"$f":"IF(L14=$AB$9,$AB$10,IF(L14=$AC$9,$AC$10,IF(L14=$AD$9,$AD$10,IF(L14=$AE$9,$AE$10))))","v":false},{"$f":"IF(M14=$AB$9,$AB$10,IF(M14=$AC$9,$AC$10,IF(M14=$AD$9,$AD$10,IF(M14=$AE$9,$AE$10))))","v":false},{"$f":"IF(N14=$AB$9,$AB$10,IF(N14=$AC$9,$AC$10,IF(N14=$AD$9,$AD$10,IF(N14=$AE$9,$AE$10))))","v":false},{"$f":"SUM(AL14:AO14)","v":0},{"$f":"IF(O14=$AB$9,$AB$10,IF(O14=$AC$9,$AC$10,IF(O14=$AD$9,$AD$10,IF(O14=$AE$9,$AE$10))))","v":false},{"$f":"IF(P14=$AB$9,$AB$10,IF(P14=$AC$9,$AC$10,IF(P14=$AD$9,$AD$10,IF(P14=$AE$9,$AE$10))))","v":false},{"$f":"IF(Q14=$AB$9,$AB$10,IF(Q14=$AC$9,$AC$10,IF(Q14=$AD$9,$AD$10,IF(Q14=$AE$9,$AE$10))))","v":false},{"$f":"IF(R14=$AB$9,$AB$10,IF(R14=$AC$9,$AC$10,IF(R14=$AD$9,$AD$10,IF(R14=$AE$9,$AE$10))))","v":false},{"$f":"SUM(AQ14:AT14)","v":0},{"$f":"MAX(AF14,AK14,AP14,AU14)","v":0}]
[2,{"$f":"CONCATENATE(FILIACION_ESTUDIANTE!B9,\"  \",FILIACION_ESTUDIANTE!C9,\"  \",FILIACION_ESTUDIANTE!D9)","v":"    "}]
[3,{"$f":"CONCATENATE(FILIACION_ESTUDIANTE!B10,\"  \",FILIACION_ESTUDIANTE!C10,\"  \",FILIACION_ESTUDIANTE!D10)","v":"    "}]
[4,{"$f":"CONCATENATE(FILIACION_ESTUDIANTE!B11,\"  \",FILIACION_ESTUDIANTE!C11,\"  \",FILIACION_ESTUDIANTE!D11)","v":"    "}]
[5,{"$f":"CONCATENATE(FILIACION_ESTUDIANTE!B12,\"  \",FILIACION_ESTUDIANTE!C12,\"  \",FILIACION_ESTUDIANTE!D12)","v":"    "}]
[6,{"$f":"CONCATENATE(FILIACION_ESTUDIANTE!B13,\"  \",FILIACION_ESTUDIANTE!C13,\"  \",FILIACION_ESTUDIANTE!D13)","v":"    "}]
[7,{"$f":"CONCATENATE(FILIACION_ESTUDIANTE!B14,\"  \",FILIACION_ESTUDIANTE!C14,\"  \",FILIACION_ESTUDIANTE!D14)","v":"    "}]
[8,{"$f":"CONCATENATE(FILIACION_ESTUDIANTE!B15,\"  \",FILIACION_ESTUDIANTE!C15,\"  \",FILIACION_ESTUDIANTE!D15)","v":"    "}]
[9,{"$f":"CONCATENATE(FILIACION_ESTUDIANTE!B16,\"  \",FILIACION_ESTUDIANTE!C16,\"  \",FILIACION_ESTUDIANTE!D16)","v":"    "}]
[10,{"$f":"CONCATENATE(FILIACION_ESTUDIANTE!B17,\"  \",FILIACION_ESTUDIANTE!C17,\"  \",FILIACION_ESTUDIANTE!D17)","v":"    "}]
[11,{"$f":"CONCATENATE(FILIACION_ESTUDIANTE!B18,\"  \",FILIACION_ESTUDIANTE!C18,\"  \",FILIACION_ESTUDIANTE!D18)","v":"    "}]
[12,{"$f":"CONCATENATE(FILIACION_ESTUDIANTE!B19,\"  \",FILIACION_ESTUDIANTE!C19,\"  \",FILIACION_ESTUDIANTE!D19)","v":"    "}]
[13,{"$f":"CONCATENATE(FILIACION_ESTUDIANTE!B20,\"  \",FILIACION_ESTUDIANTE!C20,\"  \",FILIACION_ESTUDIANTE!D20)","v":"    "}]
[14,{"$f":"CONCATENATE(FILIACION_ESTUDIANTE!B21,\"  \",FILIACION_ESTUDIANTE!C21,\"  \",FILIACION_ESTUDIANTE!D21)","v":"    "}]
[15,{"$f":"CONCATENATE(FILIACION_ESTUDIANTE!B22,\"  \",FILIACION_ESTUDIANTE!C22,\"  \",FILIACION_ESTUDIANTE!D22)","v":"    "}]
[16,{"$f":"CONCATENATE(FILIACION_ESTUDIANTE!B23,\"  \",FILIACION_ESTUDIANTE!C23,\"  \",FILIACION_ESTUDIANTE!D23)","v":"    "}]
[17,{"$f":"CONCATENATE(FILIACION_ESTUDIANTE!B24,\"  \",FILIACION_ESTUDIANTE!C24,\"  \",FILIACION_ESTUDIANTE!D24)","v":"    "}]
[18,{"$f":"CONCATENATE(FILIACION_ESTUDIANTE!B25,\"  \",FILIACION_ESTUDIANTE!C25,\"  \",FILIACION_ESTUDIANTE!D25)","v":"    "}]
[19,{"$f":"CONCATENATE(FILIACION_ESTUDIANTE!B26,\"  \",FILIACION_ESTUDIANTE!C26,\"  \",FILIACION_ESTUDIANTE!D26)","v":"    "}]
[20,{"$f":"CONCATENATE(FILIACION_ESTUDIANTE!B27,\"  \",FILIACION_ESTUDIANTE!C27,\"  \",FILIACION_ESTUDIANTE!D27)","v":"    "}]
[21,{"$f":"CONCATENATE(FILIACION_ESTUDIANTE!B28,\"  \",FILIACION_ESTUDIANTE!C28,\"  \",FILIACION_ESTUDIANTE!D28)","v":"    "}]
[22,{"$f":"CONCATENATE(FILIACION_ESTUDIANTE!B29,\"  \",FILIACION_ESTUDIANTE!C29,\"  \",FILIACION_ESTUDIANTE!D29)","v":"    "}]
[23,{"$f":"CONCATENATE(FILIACION_ESTUDIANTE!B30,\"  \",FILIACION_ESTUDIANTE!C30,\"  \",FILIACION_ESTUDIANTE!D30)","v":"    "}]
[24,{"$f":"CONCATENATE(FILIACION_ESTUDIANTE!B31,\"  \",FILIACION_ESTUDIANTE!C31,\"  \",FILIACION_ESTUDIANTE!D31)","v":"    "}]
[25,{"$f":"CONCATENATE(FILIACION_ESTUDIANTE!B32,\"  \",FILIACION_ESTUDIANTE!C32,\"  \",FILIACION_ESTUDIANTE!D32)","v":"    "}]
[26,{"$f":"CONCATENATE(FILIACION_ESTUDIANTE!B33,\"  \",FILIACION_ESTUDIANTE!C33,\"  \",FILIACION_ESTUDIANTE!D33)","v":"    "}]
[27,{"$f":"CONCATENATE(FILIACION_ESTUDIANTE!B34,\"  \",FILIACION_ESTUDIANTE!C34,\"  \",FILIACION_ESTUDIANTE!D34)","v":"    "}]
[28,{"$f":"CONCATENATE(FILIACION_ESTUDIANTE!B35,\"  \",FILIACION_ESTUDIANTE!C35,\"  \",FILIACION_ESTUDIANTE!D35)","v":"    "}]
[29,{"$f":"CONCATENATE(FILIACION_ESTUDIANTE!B36,\"  \",FILIACION_ESTUDIANTE!C36,\"  \",FILIACION_ESTUDIANTE!D36)","v":"    "}]
[30,{"$f":"CONCATENATE(FILIACION_ESTUDIANTE!B37,\"  \",FILIACION_ESTUDIANTE!C37,\"  \",FILIACION_ESTUDIANTE!D37)","v":"    "}]
[31,{"$f":"CONCATENATE(FILIACION_ESTUDIANTE!B38,\"  \",FILIACION_ESTUDIANTE!C38,\"  \",FILIACION_ESTUDIANTE!D38)","v":"    "}]
[32,{"$f":"CONCATENATE(FILIACION_ESTUDIANTE!B39,\"  \",FILIACION_ESTUDIANTE!C39,\"  \",FILIACION_ESTUDIANTE!D39)","v":"    "}]
[33,{"$f":"CONCATENATE(FILIACION_ESTUDIANTE!B40,\"  \",FILIACION_ESTUDIANTE!C40,\"  \",FILIACION_ESTUDIANTE!D40)","v":"    "}]
[34,{"$f":"CONCATENATE(FILIACION_ESTUDIANTE!B41,\"  \",FILIACION_ESTUDIANTE!C41,\"  \",FILIACION_ESTUDIANTE!D41)","v":"    "}]
[35,{"$f":"CONCATENATE(FILIACION_ESTUDIANTE!B42,\"  \",FILIACION_ESTUDIANTE!C42,\"  \",FILIACION_ESTUDIANTE!D42)","v":"    "}]
[36,{"$f":"CONCATENATE(FILIACION_ESTUDIANTE!B43,\"  \",FILIACION_ESTUDIANTE!C43,\"  \",FILIACION_ESTUDIANTE!D43)","v":"    "}]
[37,{"$f":"CONCATENATE(FILIACION_ESTUDIANTE!B44,\"  \",FILIACION_ESTUDIANTE!C44,\"  \",FILIACION_ESTUDIANTE!D44)","v":"    "}]
[38,{"$f":"CONCATENATE(FILIACION_ESTUDIANTE!B45,\"  \",FILIACION_ESTUDIANTE!C45,\"  \",FILIACION_ESTUDIANTE!D45)","v":"    "}]
[39,{"$f":"CONCATENATE(FILIACION_ESTUDIANTE!B46,\"  \",FILIACION_ESTUDIANTE!C46,\"  \",FILIACION_ESTUDIANTE!D46)","v":"    "}]
[40,{"$f":"CONCATENATE(FILIACION_ESTUDIANTE!B47,\"  \",FILIACION_ESTUDIANTE!C47,\"  \",FILIACION_ESTUDIANTE!D47)","v":"    "}]

{"sheet":"CIENCIA_TEC_1B","index":29,"n_rows":53,"n_cols":48,"rows_kept":53,"cut":false,"hidden":false,"merged":[[11,14,12,14],[11,7,12,7],[11,8,12,8],[11,9,12,9],[11,10,12,10],[11,11,12,11],[11,2,12,2],[11,3,12,3],[11,4,12,4],[11,5,12,5],[11,6,12,6],[33,18,33,19],[34,18,34,19],[35,18,35,19],[36,18,36,19],[37,18,37,19],[38,18,38,19],[39,18,39,19],[40,18,40,19],[41,18,41,19],[42,18,42,19],[51,18,51,19],[52,18,52,19],[43,18,43,19],[44,18,44,19],[45,18,45,19],[46,18,46,19],[47,18,47,19],[48,18,48,19],[49,18,49,19],[50,18,50,19],[29,18,29,19],[30,18,30,19],[31,18,31,19],[32,18,32,19],[23,18,23,19],[24,18,24,19],[25,18,25,19],[26,18,26,19],[27,18,27,19],[28,18,28,19],[18,18,18,19],[19,18,19,19],[20,18,20,19],[21,18,21,19],[22,18,22,19],[13,18,13,19],[14,18,14,19],[15,18,15,19],[16,18,16,19],[17,18,17,19],[1,1,2,1],[1,2,1,19],[1,27,6,31],[2,2,2,19],[3,0,3,1],[3,2,3,11],[3,12,3,17],[3,18,3,20],[4,0,4,20],[5,0,5,1],[6,0,12,0],[6,2,6,5],[6,6,6,9],[6,10,6,13],[6,14,6,17],[5,2,5,20],[7,6,9,6],[7,7,9,7],[7,8,9,8],[7,9,9,9],[7,10,9,10],[7,1,9,1],[7,2,9,2],[7,3,9,3],[7,4,9,4],[7,5,9,5],[6,18,8,19],[7,11,9,11],[7,12,9,12],[7,14,9,14],[6,20,12,20],[7,13,9,13],[7,15,9,15],[7,16,9,16],[7,17,9,17],[11,15,12,15],[11,16,12,16],[11,17,12,17],[11,18,12,19],[10,18,10,19],[11,12,12,12],[11,13,12,13]]}
[]
[null,null,"CUADRO DE VALORACIÓN",null,null,null,null,null,null,null,null,null,null,null,null,null,null,null,null,null,null,null,null,null,null,null,null,"REGISTRO DE VALORACION",null,null,null,null,"ED",null,null,null,null,null,null,null,"DA","DO",null,"DP"]
[null,null,"EDUCACIÓN INICIAL  EN FAMILIA COMUNITARIA ",null,null,null,null,null,null,null,null,null,null,null,null,null,null,null,null,null,"1er BIMESTRE"]
[{"$f":"UPPER( CARATULA!$C$20)","v":"MAESTRA (O):"},null,{"$f":"CARATULA!$E$20","v":0},null,null,null,null,null,null,null,null,null,{"$f":"UPPER(CARATULA!$C$21)","v":"AÑO DE ESCOLARIDAD:"},null,null,null,null,null,{"$f":"CARATULA!$E$21","v":0}]
["CAMPO DE SABER Y CONOCIMIENTO -  CIENCIA TECNOLOGÍA Y PRODUCCIÓN "]
["EVALUACIÓN",null,"CRITERIOS DE LAS DIMENSIONES"]
["Nº","DIMENSIONES","SER",null,null,null,"SABER",null,null,null,"HACER",null,null,null,"DECIDIR",null,null,null,"AUTOEVALUACIÓN (SER, SABER, HACER, DECIDIR)",null,"SÍNTESIS CUALITATIVA DEL BIMESTRE"]
[null,"PLANES DE CLASE (PDC)","PDC","PDC","PDC","PDC","PDC","PDC","PDC","PDC","PDC","PDC","PDC","PDC","PDC","PDC","PDC","PDC"]
[null,null,null,null,null,null,null,null,null,null,null,null,null,null,null,null,null,null,null,null,null,null,null,null,null,null,null,"DP","DO","DA","ED"]
[null,null,null,null,null,null,null,null,null,null,null,null,null,null,null,null,null,null,null,null,null,null,null,null,null,null,null,14,8,5,1]
[null,"CRITERIOS DE EVALUACIÓN"]
[null,"INSTRUMENTOS Y/O ESTRATEGIAS DE EVALUACIÓN"]
[null,"APELLIDOS Y NOMBRES"]
[1,{"$f":"CONCATENATE(FILIACION_ESTUDIANTE!B8,\"  \",FILIACION_ESTUDIANTE!C8,\"  \",FILIACION_ESTUDIANTE!D8)","v":"    "},null,null,null,null,null,null,null,null,null,null,null,null,null,null,null,null,null,null,null,null,null,"demuestra  algunas actitudes armonicas etre sfamilia Y  LE FALTAT",null,null,null,{"$f":"IF(C14=$AB$9,$AB$10,IF(C14=$AC$9,$AC$10,IF(C14=$AD$9,$AD$10,IF(C14=$AE$9,$AE$10))))","v":false},{"$f":"IF(D14=$AB$9,$AB$10,IF(D14=$AC$9,$AC$10,IF(D14=$AD$9,$AD$10,IF(D14=$AE$9,$AE$10))))","v":false},{"$f":"IF(E14=$AB$9,$AB$10,IF(E14=$AC$9,$AC$10,IF(E14=$AD$9,$AD$10,IF(E14=$AE$9,$AE$10))))","v":false},{"$f":"IF(F14=$AB$9,$AB$10,IF(F14=$AC$9,$AC$10,IF(F14=$AD$9,$AD$10,IF(F14=$AE$9,$AE$10))))","v":false},{"$f":"SUM(AB14:AE14)","v":0},{"$f":"IF(G14=$AB$9,$AB$10,IF(G14=$AC$9,$AC$10,IF(G14=$AD$9,$AD$10,IF(G14=$AE$9,$AE$10))))","v":false},{"$f":"IF(H14=$AB$9,$AB$10,IF(H14=$AC$9,$AC$10,IF(H14=$AD$9,$AD$10,IF(H14=$AE$9,$AE$10))))","v":false},{"$f":"IF(I14=$AB$9,$AB$10,IF(I14=$AC$9,$AC$10,IF(I14=$AD$9,$AD$10,IF(I14=$AE$9,$AE$10))))","v":false},{"$f":"IF(J14=$AB$9,$AB$10,IF(J14=$AC$9,$AC$10,IF(J14=$AD$9,$AD$10,IF(J14=$AE$9,$AE$10))))","v":false},{"$f":"SUM(AG14:AJ14)","v":0},{"$f":"IF(K14=$AB$9,$AB$10,IF(K14=$AC$9,$AC$10,IF(K14=$AD$9,$AD$10,IF(K14=$AE$9,$AE$10))))","v":false},{"$f":"IF(L14=$AB$9,$AB$10,IF(L14=$AC$9,$AC$10,IF(L14=$AD$9,$AD$10,IF(L14=$AE$9,$AE$10))))","v":false},{"$f":"IF(M14=$AB$9,$AB$10,IF(M14=$AC$9,$AC$10,IF(M14=$AD$9,$AD$10,IF(M14=$AE$9,$AE$10))))","v":false},{"$f":"IF(N14=$AB$9,$AB$10,IF(N14=$AC$9,$AC$10,IF(N14=$AD$9,$AD$10,IF(N14=$AE$9,$AE$10))))","v":false},{"$f":"SUM(AL14:AO14)","v":0},{"$f":"IF(O14=$AB$9,$AB$10,IF(O14=$AC$9,$AC$10,IF(O14=$AD$9,$AD$10,IF(O14=$AE$9,$AE$10))))","v":false},{"$f":"IF(P14=$AB$9,$AB$10,IF(P14=$AC$9,$AC$10,IF(P14=$AD$9,$AD$10,IF(P14=$AE$9,$AE$10))))","v":false},{"$f":"IF(Q14=$AB$9,$AB$10,IF(Q14=$AC$9,$AC$10,IF(Q14=$AD$9,$AD$10,IF(Q14=$AE$9,$AE$10))))","v":false},{"$f":"IF(R14=$AB$9,$AB$10,IF(R14=$AC$9,$AC$10,IF(R14=$AD$9,$AD$10,IF(R14=$AE$9,$AE$10))))","v":false},{"$f":"SUM(AQ14:AT14)","v":0},{"$f":"MAX(AF14,AK14,AP14,AU14)","v":0}]
[2,{"$f":"CONCATENATE(FILIACION_ESTUDIANTE!B9,\"  \",FILIACION_ESTUDIANTE!C9,\"  \",FILIACION_ESTUDIANTE!D9)","v":"    "}]
[3,{"$f":"CONCATENATE(FILIACION_ESTUDIANTE!B10,\"  \",FILIACION_ESTUDIANTE!C10,\"  \",FILIACION_ESTUDIANTE!D10)","v":"    "}]
[4,{"$f":"CONCATENATE(FILIACION_ESTUDIANTE!B11,\"  \",FILIACION_ESTUDIANTE!C11,\"  \",FILIACION_ESTUDIANTE!D11)","v":"    "}]
[5,{"$f":"CONCATENATE(FILIACION_ESTUDIANTE!B12,\"  \",FILIACION_ESTUDIANTE!C12,\"  \",FILIACION_ESTUDIANTE!D12)","v":"    "}]
[6,{"$f":"CONCATENATE(FILIACION_ESTUDIANTE!B13,\"  \",FILIACION_ESTUDIANTE!C13,\"  \",FILIACION_ESTUDIANTE!D13)","v":"    "}]
[7,{"$f":"CONCATENATE(FILIACION_ESTUDIANTE!B14,\"  \",FILIACION_ESTUDIANTE!C14,\"  \",FILIACION_ESTUDIANTE!D14)","v":"    "}]
[8,{"$f":"CONCATENATE(FILIACION_ESTUDIANTE!B15,\"  \",FILIACION_ESTUDIANTE!C15,\"  \",FILIACION_ESTUDIANTE!D15)","v":"    "}]
[9,{"$f":"CONCATENATE(FILIACION_ESTUDIANTE!B16,\"  \",FILIACION_ESTUDIANTE!C16,\"  \",FILIACION_ESTUDIANTE!D16)","v":"    "}]
[10,{"$f":"CONCATENATE(FILIACION_ESTUDIANTE!B17,\"  \",FILIACION_ESTUDIANTE!C17,\"  \",FILIACION_ESTUDIANTE!D17)","v":"    "}]
[11,{"$f":"CONCATENATE(FILIACION_ESTUDIANTE!B18,\"  \",FILIACION_ESTUDIANTE!C18,\"  \",FILIACION_ESTUDIANTE!D18)","v":"    "}]
[12,{"$f":"CONCATENATE(FILIACION_ESTUDIANTE!B19,\"  \",FILIACION_ESTUDIANTE!C19,\"  \",FILIACION_ESTUDIANTE!D19)","v":"    "}]
[13,{"$f":"CONCATENATE(FILIACION_ESTUDIANTE!B20,\"  \",FILIACION_ESTUDIANTE!C20,\"  \",FILIACION_ESTUDIANTE!D20)","v":"    "}]
[14,{"$f":"CONCATENATE(FILIACION_ESTUDIANTE!B21,\"  \",FILIACION_ESTUDIANTE!C21,\"  \",FILIACION_ESTUDIANTE!D21)","v":"    "}]
[15,{"$f":"CONCATENATE(FILIACION_ESTUDIANTE!B22,\"  \",FILIACION_ESTUDIANTE!C22,\"  \",FILIACION_ESTUDIANTE!D22)","v":"    "}]
[16,{"$f":"CONCATENATE(FILIACION_ESTUDIANTE!B23,\"  \",FILIACION_ESTUDIANTE!C23,\"  \",FILIACION_ESTUDIANTE!D23)","v":"    "}]
[17,{"$f":"CONCATENATE(FILIACION_ESTUDIANTE!B24,\"  \",FILIACION_ESTUDIANTE!C24,\"  \",FILIACION_ESTUDIANTE!D24)","v":"    "}]
[18,{"$f":"CONCATENATE(FILIACION_ESTUDIANTE!B25,\"  \",FILIACION_ESTUDIANTE!C25,\"  \",FILIACION_ESTUDIANTE!D25)","v":"    "}]
[19,{"$f":"CONCATENATE(FILIACION_ESTUDIANTE!B26,\"  \",FILIACION_ESTUDIANTE!C26,\"  \",FILIACION_ESTUDIANTE!D26)","v":"    "}]
[20,{"$f":"CONCATENATE(FILIACION_ESTUDIANTE!B27,\"  \",FILIACION_ESTUDIANTE!C27,\"  \",FILIACION_ESTUDIANTE!D27)","v":"    "}]
[21,{"$f":"CONCATENATE(FILIACION_ESTUDIANTE!B28,\"  \",FILIACION_ESTUDIANTE!C28,\"  \",FILIACION_ESTUDIANTE!D28)","v":"    "}]
[22,{"$f":"CONCATENATE(FILIACION_ESTUDIANTE!B29,\"  \",FILIACION_ESTUDIANTE!C29,\"  \",FILIACION_ESTUDIANTE!D29)","v":"    "}]
[23,{"$f":"CONCATENATE(FILIACION_ESTUDIANTE!B30,\"  \",FILIACION_ESTUDIANTE!C30,\"  \",FILIACION_ESTUDIANTE!D30)","v":"    "}]
[24,{"$f":"CONCATENATE(FILIACION_ESTUDIANTE!B31,\"  \",FILIACION_ESTUDIANTE!C31,\"  \",FILIACION_ESTUDIANTE!D31)","v":"    "}]
[25,{"$f":"CONCATENATE(FILIACION_ESTUDIANTE!B32,\"  \",FILIACION_ESTUDIANTE!C32,\"  \",FILIACION_ESTUDIANTE!D32)","v":"    "}]
[26,{"$f":"CONCATENATE(FILIACION_ESTUDIANTE!B33,\"  \",FILIACION_ESTUDIANTE!C33,\"  \",FILIACION_ESTUDIANTE!D33)","v":"    "}]
[27,{"$f":"CONCATENATE(FILIACION_ESTUDIANTE!B34,\"  \",FILIACION_ESTUDIANTE!C34,\"  \",FILIACION_ESTUDIANTE!D34)","v":"    "}]
[28,{"$f":"CONCATENATE(FILIACION_ESTUDIANTE!B35,\"  \",FILIACION_ESTUDIANTE!C35,\"  \",FILIACION_ESTUDIANTE!D35)","v":"    "}]
[29,{"$f":"CONCATENATE(FILIACION_ESTUDIANTE!B36,\"  \",FILIACION_ESTUDIANTE!C36,\"  \",FILIACION_ESTUDIANTE!D36)","v":"    "}]
[30,{"$f":"CONCATENATE(FILIACION_ESTUDIANTE!B37,\"  \",FILIACION_ESTUDIANTE!C37,\"  \",FILIACION_ESTUDIANTE!D37)","v":"    "}]
[31,{"$f":"CONCATENATE(FILIACION_ESTUDIANTE!B38,\"  \",FILIACION_ESTUDIANTE!C38,\"  \",FILIACION_ESTUDIANTE!D38)","v":"    "}]
[32,{"$f":"CONCATENATE(FILIACION_ESTUDIANTE!B39,\"  \",FILIACION_ESTUDIANTE!C39,\"  \",FILIACION_ESTUDIANTE!D39)","v":"    "}]
[33,{"$f":"CONCATENATE(FILIACION_ESTUDIANTE!B40,\"  \",FILIACION_ESTUDIANTE!C40,\"  \",FILIACION_ESTUDIANTE!D40)","v":"    "}]
[34,{"$f":"CONCATENATE(FILIACION_ESTUDIANTE!B41,\"  \",FILIACION_ESTUDIANTE!C41,\"  \",FILIACION_ESTUDIANTE!D41)","v":"    "}]
[35,{"$f":"CONCATENATE(FILIACION_ESTUDIANTE!B42,\"  \",FILIACION_ESTUDIANTE!C42,\"  \",FILIACION_ESTUDIANTE!D42)","v":"    "}]
[36,{"$f":"CONCATENATE(FILIACION_ESTUDIANTE!B43,\"  \",FILIACION_ESTUDIANTE!C43,\"  \",FILIACION_ESTUDIANTE!D43)","v":"    "}]
[37,{"$f":"CONCATENATE(FILIACION_ESTUDIANTE!B44,\"  \",FILIACION_ESTUDIANTE!C44,\"  \",FILIACION_ESTUDIANTE!D44)","v":"    "}]
[38,{"$f":"CONCATENATE(FILIACION_ESTUDIANTE!B45,\"  \",FILIACION_ESTUDIANTE!C45,\"  \",FILIACION_ESTUDIANTE!D45)","v":"    "}]
[39,{"$f":"CONCATENATE(FILIACION_ESTUDIANTE!B46,\"  \",FILIACION_ESTUDIANTE!C46,\"  \",FILIACION_ESTUDIANTE!D46)","v":"    "}]
[40,{"$f":"CONCATENATE(FILIACION_ESTUDIANTE!B47,\"  \",FILIACION_ESTUDIANTE!C47,\"  \",FILIACION_ESTUDIANTE!D47)","v":"    "}]

{"sheet":"CIENCIA_TEC_2B","index":30,"n_rows":53,"n_cols":48,"rows_kept":53,"cut":false,"hidden":false,"merged":[[11,14,12,14],[11,7,12,7],[11,8,12,8],[11,9,12,9],[11,10,12,10],[11,11,12,11],[11,2,12,2],[11,3,12,3],[11,4,12,4],[11,5,12,5],[11,6,12,6],[33,18,33,19],[34,18,34,19],[35,18,35,19],[36,18,36,19],[37,18,37,19],[38,18,38,19],[39,18,39,19],[40,18,40,19],[41,18,41,19],[42,18,42,19],[51,18,51,19],[52,18,52,19],[43,18,43,19],[44,18,44,19],[45,18,45,19],[46,18,46,19],[47,18,47,19],[48,18,48,19],[49,18,49,19],[50,18,50,19],[29,18,29,19],[30,18,30,19],[31,18,31,19],[32,18,32,19],[23,18,23,19],[24,18,24,19],[25,18,25,19],[26,18,26,19],[27,18,27,19],[28,18,28,19],[18,18,18,19],[19,18,19,19],[20,18,20,19],[21,18,21,19],[22,18,22,19],[13,18,13,19],[14,18,14,19],[15,18,15,19],[16,18,16,19],[17,18,17,19],[1,1,2,1],[1,2,1,19],[1,27,6,31],[2,2,2,19],[3,0,3,1],[3,2,3,11],[3,12,3,17],[3,18,3,20],[4,0,4,20],[5,0,5,1],[6,0,12,0],[6,2,6,5],[6,6,6,9],[6,10,6,13],[6,14,6,17],[5,2,5,20],[7,6,9,6],[7,7,9,7],[7,8,9,8],[7,9,9,9],[7,10,9,10],[7,1,9,1],[7,2,9,2],[7,3,9,3],[7,4,9,4],[7,5,9,5],[6,18,8,19],[7,11,9,11],[7,12,9,12],[7,14,9,14],[6,20,12,20],[7,13,9,13],[7,15,9,15],[7,16,9,16],[7,17,9,17],[11,15,12,15],[11,16,12,16],[11,17,12,17],[11,18,12,19],[10,18,10,19],[11,12,12,12],[11,13,12,13]]}
[]
[null,null,"CUADRO DE VALORACIÓN",null,null,null,null,null,null,null,null,null,null,null,null,null,null,null,null,null,null,null,null,null,null,null,null,"REGISTRO DE VALORACION",null,null,null,null,"ED",null,null,null,null,null,null,null,"DA","DO",null,"DP"]
[null,null,"EDUCACIÓN INICIAL  EN FAMILIA COMUNITARIA ",null,null,null,null,null,null,null,null,null,null,null,null,null,null,null,null,null,"2° BIMESTRE"]
[{"$f":"UPPER( CARATULA!$C$20)","v":"MAESTRA (O):"},null,{"$f":"CARATULA!$E$20","v":0},null,null,null,null,null,null,null,null,null,{"$f":"UPPER(CARATULA!$C$21)","v":"AÑO DE ESCOLARIDAD:"},null,null,null,null,null,{"$f":"CARATULA!$E$21","v":0}]
["CAMPO DE SABER Y CONOCIMIENTO -  CIENCIA TECNOLOGÍA Y PRODUCCIÓN "]
["EVALUACIÓN",null,"CRITERIOS DE LAS DIMENSIONES"]
["Nº","DIMENSIONES","SER",null,null,null,"SABER",null,null,null,"HACER",null,null,null,"DECIDIR",null,null,null,"AUTOEVALUACIÓN (SER, SABER, HACER, DECIDIR)",null,"SÍNTESIS CUALITATIVA DEL BIMESTRE"]
[null,"PLANES DE CLASE (PDC)","PDC","PDC","PDC","PDC","PDC","PDC","PDC","PDC","PDC","PDC","PDC","PDC","PDC","PDC","PDC","PDC"]
[null,null,null,null,null,null,null,null,null,null,null,null,null,null,null,null,null,null,null,null,null,null,null,null,null,null,null,"DP","DO","DA","ED"]
[null,null,null,null,null,null,null,null,null,null,null,null,null,null,null,null,null,null,null,null,null,null,null,null,null,null,null,14,8,5,1]
[null,"CRITERIOS DE EVALUACIÓN"]
[null,"INSTRUMENTOS Y/O ESTRATEGIAS DE EVALUACIÓN"]
[null,"APELLIDOS Y NOMBRES"]
[1,{"$f":"CONCATENATE(FILIACION_ESTUDIANTE!B8,\"  \",FILIACION_ESTUDIANTE!C8,\"  \",FILIACION_ESTUDIANTE!D8)","v":"    "},null,null,null,null,null,null,null,null,null,null,null,null,null,null,null,null,null,null,null,null,null,"demuestra  algunas actitudes armonicas etre sfamilia Y  LE FALTAT",null,null,null,{"$f":"IF(C14=$AB$9,$AB$10,IF(C14=$AC$9,$AC$10,IF(C14=$AD$9,$AD$10,IF(C14=$AE$9,$AE$10))))","v":false},{"$f":"IF(D14=$AB$9,$AB$10,IF(D14=$AC$9,$AC$10,IF(D14=$AD$9,$AD$10,IF(D14=$AE$9,$AE$10))))","v":false},{"$f":"IF(E14=$AB$9,$AB$10,IF(E14=$AC$9,$AC$10,IF(E14=$AD$9,$AD$10,IF(E14=$AE$9,$AE$10))))","v":false},{"$f":"IF(F14=$AB$9,$AB$10,IF(F14=$AC$9,$AC$10,IF(F14=$AD$9,$AD$10,IF(F14=$AE$9,$AE$10))))","v":false},{"$f":"SUM(AB14:AE14)","v":0},{"$f":"IF(G14=$AB$9,$AB$10,IF(G14=$AC$9,$AC$10,IF(G14=$AD$9,$AD$10,IF(G14=$AE$9,$AE$10))))","v":false},{"$f":"IF(H14=$AB$9,$AB$10,IF(H14=$AC$9,$AC$10,IF(H14=$AD$9,$AD$10,IF(H14=$AE$9,$AE$10))))","v":false},{"$f":"IF(I14=$AB$9,$AB$10,IF(I14=$AC$9,$AC$10,IF(I14=$AD$9,$AD$10,IF(I14=$AE$9,$AE$10))))","v":false},{"$f":"IF(J14=$AB$9,$AB$10,IF(J14=$AC$9,$AC$10,IF(J14=$AD$9,$AD$10,IF(J14=$AE$9,$AE$10))))","v":false},{"$f":"SUM(AG14:AJ14)","v":0},{"$f":"IF(K14=$AB$9,$AB$10,IF(K14=$AC$9,$AC$10,IF(K14=$AD$9,$AD$10,IF(K14=$AE$9,$AE$10))))","v":false},{"$f":"IF(L14=$AB$9,$AB$10,IF(L14=$AC$9,$AC$10,IF(L14=$AD$9,$AD$10,IF(L14=$AE$9,$AE$10))))","v":false},{"$f":"IF(M14=$AB$9,$AB$10,IF(M14=$AC$9,$AC$10,IF(M14=$AD$9,$AD$10,IF(M14=$AE$9,$AE$10))))","v":false},{"$f":"IF(N14=$AB$9,$AB$10,IF(N14=$AC$9,$AC$10,IF(N14=$AD$9,$AD$10,IF(N14=$AE$9,$AE$10))))","v":false},{"$f":"SUM(AL14:AO14)","v":0},{"$f":"IF(O14=$AB$9,$AB$10,IF(O14=$AC$9,$AC$10,IF(O14=$AD$9,$AD$10,IF(O14=$AE$9,$AE$10))))","v":false},{"$f":"IF(P14=$AB$9,$AB$10,IF(P14=$AC$9,$AC$10,IF(P14=$AD$9,$AD$10,IF(P14=$AE$9,$AE$10))))","v":false},{"$f":"IF(Q14=$AB$9,$AB$10,IF(Q14=$AC$9,$AC$10,IF(Q14=$AD$9,$AD$10,IF(Q14=$AE$9,$AE$10))))","v":false},{"$f":"IF(R14=$AB$9,$AB$10,IF(R14=$AC$9,$AC$10,IF(R14=$AD$9,$AD$10,IF(R14=$AE$9,$AE$10))))","v":false},{"$f":"SUM(AQ14:AT14)","v":0},{"$f":"MAX(AF14,AK14,AP14,AU14)","v":0}]
[2,{"$f":"CONCATENATE(FILIACION_ESTUDIANTE!B9,\"  \",FILIACION_ESTUDIANTE!C9,\"  \",FILIACION_ESTUDIANTE!D9)","v":"    "}]
[3,{"$f":"CONCATENATE(FILIACION_ESTUDIANTE!B10,\"  \",FILIACION_ESTUDIANTE!C10,\"  \",FILIACION_ESTUDIANTE!D10)","v":"    "}]
[4,{"$f":"CONCATENATE(FILIACION_ESTUDIANTE!B11,\"  \",FILIACION_ESTUDIANTE!C11,\"  \",FILIACION_ESTUDIANTE!D11)","v":"    "}]
[5,{"$f":"CONCATENATE(FILIACION_ESTUDIANTE!B12,\"  \",FILIACION_ESTUDIANTE!C12,\"  \",FILIACION_ESTUDIANTE!D12)","v":"    "}]
[6,{"$f":"CONCATENATE(FILIACION_ESTUDIANTE!B13,\"  \",FILIACION_ESTUDIANTE!C13,\"  \",FILIACION_ESTUDIANTE!D13)","v":"    "}]
[7,{"$f":"CONCATENATE(FILIACION_ESTUDIANTE!B14,\"  \",FILIACION_ESTUDIANTE!C14,\"  \",FILIACION_ESTUDIANTE!D14)","v":"    "}]
[8,{"$f":"CONCATENATE(FILIACION_ESTUDIANTE!B15,\"  \",FILIACION_ESTUDIANTE!C15,\"  \",FILIACION_ESTUDIANTE!D15)","v":"    "}]
[9,{"$f":"CONCATENATE(FILIACION_ESTUDIANTE!B16,\"  \",FILIACION_ESTUDIANTE!C16,\"  \",FILIACION_ESTUDIANTE!D16)","v":"    "}]
[10,{"$f":"CONCATENATE(FILIACION_ESTUDIANTE!B17,\"  \",FILIACION_ESTUDIANTE!C17,\"  \",FILIACION_ESTUDIANTE!D17)","v":"    "}]
[11,{"$f":"CONCATENATE(FILIACION_ESTUDIANTE!B18,\"  \",FILIACION_ESTUDIANTE!C18,\"  \",FILIACION_ESTUDIANTE!D18)","v":"    "}]
[12,{"$f":"CONCATENATE(FILIACION_ESTUDIANTE!B19,\"  \",FILIACION_ESTUDIANTE!C19,\"  \",FILIACION_ESTUDIANTE!D19)","v":"    "}]
[13,{"$f":"CONCATENATE(FILIACION_ESTUDIANTE!B20,\"  \",FILIACION_ESTUDIANTE!C20,\"  \",FILIACION_ESTUDIANTE!D20)","v":"    "}]
[14,{"$f":"CONCATENATE(FILIACION_ESTUDIANTE!B21,\"  \",FILIACION_ESTUDIANTE!C21,\"  \",FILIACION_ESTUDIANTE!D21)","v":"    "}]
[15,{"$f":"CONCATENATE(FILIACION_ESTUDIANTE!B22,\"  \",FILIACION_ESTUDIANTE!C22,\"  \",FILIACION_ESTUDIANTE!D22)","v":"    "}]
[16,{"$f":"CONCATENATE(FILIACION_ESTUDIANTE!B23,\"  \",FILIACION_ESTUDIANTE!C23,\"  \",FILIACION_ESTUDIANTE!D23)","v":"    "}]
[17,{"$f":"CONCATENATE(FILIACION_ESTUDIANTE!B24,\"  \",FILIACION_ESTUDIANTE!C24,\"  \",FILIACION_ESTUDIANTE!D24)","v":"    "}]
[18,{"$f":"CONCATENATE(FILIACION_ESTUDIANTE!B25,\"  \",FILIACION_ESTUDIANTE!C25,\"  \",FILIACION_ESTUDIANTE!D25)","v":"    "}]
[19,{"$f":"CONCATENATE(FILIACION_ESTUDIANTE!B26,\"  \",FILIACION_ESTUDIANTE!C26,\"  \",FILIACION_ESTUDIANTE!D26)","v":"    "}]
[20,{"$f":"CONCATENATE(FILIACION_ESTUDIANTE!B27,\"  \",FILIACION_ESTUDIANTE!C27,\"  \",FILIACION_ESTUDIANTE!D27)","v":"    "}]
[21,{"$f":"CONCATENATE(FILIACION_ESTUDIANTE!B28,\"  \",FILIACION_ESTUDIANTE!C28,\"  \",FILIACION_ESTUDIANTE!D28)","v":"    "}]
[22,{"$f":"CONCATENATE(FILIACION_ESTUDIANTE!B29,\"  \",FILIACION_ESTUDIANTE!C29,\"  \",FILIACION_ESTUDIANTE!D29)","v":"    "}]
[23,{"$f":"CONCATENATE(FILIACION_ESTUDIANTE!B30,\"  \",FILIACION_ESTUDIANTE!C30,\"  \",FILIACION_ESTUDIANTE!D30)","v":"    "}]
[24,{"$f":"CONCATENATE(FILIACION_ESTUDIANTE!B31,\"  \",FILIACION_ESTUDIANTE!C31,\"  \",FILIACION_ESTUDIANTE!D31)","v":"    "}]
[25,{"$f":"CONCATENATE(FILIACION_ESTUDIANTE!B32,\"  \",FILIACION_ESTUDIANTE!C32,\"  \",FILIACION_ESTUDIANTE!D32)","v":"    "}]
[26,{"$f":"CONCATENATE(FILIACION_ESTUDIANTE!B33,\"  \",FILIACION_ESTUDIANTE!C33,\"  \",FILIACION_ESTUDIANTE!D33)","v":"    "}]
[27,{"$f":"CONCATENATE(FILIACION_ESTUDIANTE!B34,\"  \",FILIACION_ESTUDIANTE!C34,\"  \",FILIACION_ESTUDIANTE!D34)","v":"    "}]
[28,{"$f":"CONCATENATE(FILIACION_ESTUDIANTE!B35,\"  \",FILIACION_ESTUDIANTE!C35,\"  \",FILIACION_ESTUDIANTE!D35)","v":"    "}]
[29,{"$f":"CONCATENATE(FILIACION_ESTUDIANTE!B36,\"  \",FILIACION_ESTUDIANTE!C36,\"  \",FILIACION_ESTUDIANTE!D36)","v":"    "}]
[30,{"$f":"CONCATENATE(FILIACION_ESTUDIANTE!B37,\"  \",FILIACION_ESTUDIANTE!C37,\"  \",FILIACION_ESTUDIANTE!D37)","v":"    "}]
[31,{"$f":"CONCATENATE(FILIACION_ESTUDIANTE!B38,\"  \",FILIACION_ESTUDIANTE!C38,\"  \",FILIACION_ESTUDIANTE!D38)","v":"    "}]
[32,{"$f":"CONCATENATE(FILIACION_ESTUDIANTE!B39,\"  \",FILIACION_ESTUDIANTE!C39,\"  \",FILIACION_ESTUDIANTE!D39)","v":"    "}]
[33,{"$f":"CONCATENATE(FILIACION_ESTUDIANTE!B40,\"  \",FILIACION_ESTUDIANTE!C40,\"  \",FILIACION_ESTUDIANTE!D40)","v":"    "}]
[34,{"$f":"CONCATENATE(FILIACION_ESTUDIANTE!B41,\"  \",FILIACION_ESTUDIANTE!C41,\"  \",FILIACION_ESTUDIANTE!D41)","v":"    "}]
[35,{"$f":"CONCATENATE(FILIACION_ESTUDIANTE!B42,\"  \",FILIACION_ESTUDIANTE!C42,\"  \",FILIACION_ESTUDIANTE!D42)","v":"    "}]
[36,{"$f":"CONCATENATE(FILIACION_ESTUDIANTE!B43,\"  \",FILIACION_ESTUDIANTE!C43,\"  \",FILIACION_ESTUDIANTE!D43)","v":"    "}]
[37,{"$f":"CONCATENATE(FILIACION_ESTUDIANTE!B44,\"  \",FILIACION_ESTUDIANTE!C44,\"  \",FILIACION_ESTUDIANTE!D44)","v":"    "}]
[38,{"$f":"CONCATENATE(FILIACION_ESTUDIANTE!B45,\"  \",FILIACION_ESTUDIANTE!C45,\"  \",FILIACION_ESTUDIANTE!D45)","v":"    "}]
[39,{"$f":"CONCATENATE(FILIACION_ESTUDIANTE!B46,\"  \",FILIACION_ESTUDIANTE!C46,\"  \",FILIACION_ESTUDIANTE!D46)","v":"    "}]
[40,{"$f":"CONCATENATE(FILIACION_ESTUDIANTE!B47,\"  \",FILIACION_ESTUDIANTE!C47,\"  \",FILIACION_ESTUDIANTE!D47)","v":"    "}]

{"sheet":"CIENCIA_TEC_3B","index":31,"n_rows":53,"n_cols":48,"rows_kept":53,"cut":false,"hidden":false,"merged":[[11,14,12,14],[11,7,12,7],[11,8,12,8],[11,9,12,9],[11,10,12,10],[11,11,12,11],[11,2,12,2],[11,3,12,3],[11,4,12,4],[11,5,12,5],[11,6,12,6],[33,18,33,19],[34,18,34,19],[35,18,35,19],[36,18,36,19],[37,18,37,19],[38,18,38,19],[39,18,39,19],[40,18,40,19],[41,18,41,19],[42,18,42,19],[51,18,51,19],[52,18,52,19],[43,18,43,19],[44,18,44,19],[45,18,45,19],[46,18,46,19],[47,18,47,19],[48,18,48,19],[49,18,49,19],[50,18,50,19],[29,18,29,19],[30,18,30,19],[31,18,31,19],[32,18,32,19],[23,18,23,19],[24,18,24,19],[25,18,25,19],[26,18,26,19],[27,18,27,19],[28,18,28,19],[18,18,18,19],[19,18,19,19],[20,18,20,19],[21,18,21,19],[22,18,22,19],[13,18,13,19],[14,18,14,19],[15,18,15,19],[16,18,16,19],[17,18,17,19],[1,1,2,1],[1,2,1,19],[1,27,6,31],[2,2,2,19],[3,0,3,1],[3,2,3,11],[3,12,3,17],[3,18,3,20],[4,0,4,20],[5,0,5,1],[6,0,12,0],[6,2,6,5],[6,6,6,9],[6,10,6,13],[6,14,6,17],[5,2,5,20],[7,6,9,6],[7,7,9,7],[7,8,9,8],[7,9,9,9],[7,10,9,10],[7,1,9,1],[7,2,9,2],[7,3,9,3],[7,4,9,4],[7,5,9,5],[6,18,8,19],[7,11,9,11],[7,12,9,12],[7,14,9,14],[6,20,12,20],[7,13,9,13],[7,15,9,15],[7,16,9,16],[7,17,9,17],[11,15,12,15],[11,16,12,16],[11,17,12,17],[11,18,12,19],[10,18,10,19],[11,12,12,12],[11,13,12,13]]}
[]
[null,null,"CUADRO DE VALORACIÓN",null,null,null,null,null,null,null,null,null,null,null,null,null,null,null,null,null,null,null,null,null,null,null,null,"REGISTRO DE VALORACION",null,null,null,null,"ED",null,null,null,null,null,null,null,"DA","DO",null,"DP"]
[null,null,"EDUCACIÓN INICIAL  EN FAMILIA COMUNITARIA ",null,null,null,null,null,null,null,null,null,null,null,null,null,null,null,null,null,"3er BIMESTRE"]
[{"$f":"UPPER( CARATULA!$C$20)","v":"MAESTRA (O):"},null,{"$f":"CARATULA!$E$20","v":0},null,null,null,null,null,null,null,null,null,{"$f":"UPPER(CARATULA!$C$21)","v":"AÑO DE ESCOLARIDAD:"},null,null,null,null,null,{"$f":"CARATULA!$E$21","v":0}]
["CAMPO DE SABER Y CONOCIMIENTO -  CIENCIA TECNOLOGÍA Y PRODUCCIÓN "]
["EVALUACIÓN",null,"CRITERIOS DE LAS DIMENSIONES"]
["Nº","DIMENSIONES","SER",null,null,null,"SABER",null,null,null,"HACER",null,null,null,"DECIDIR",null,null,null,"AUTOEVALUACIÓN (SER, SABER, HACER, DECIDIR)",null,"SÍNTESIS CUALITATIVA DEL BIMESTRE"]
[null,"PLANES DE CLASE (PDC)","PDC","PDC","PDC","PDC","PDC","PDC","PDC","PDC","PDC","PDC","PDC","PDC","PDC","PDC","PDC","PDC"]
[null,null,null,null,null,null,null,null,null,null,null,null,null,null,null,null,null,null,null,null,null,null,null,null,null,null,null,"DP","DO","DA","ED"]
[null,null,null,null,null,null,null,null,null,null,null,null,null,null,null,null,null,null,null,null,null,null,null,null,null,null,null,14,8,5,1]
[null,"CRITERIOS DE EVALUACIÓN"]
[null,"INSTRUMENTOS Y/O ESTRATEGIAS DE EVALUACIÓN"]
[null,"APELLIDOS Y NOMBRES"]
[1,{"$f":"CONCATENATE(FILIACION_ESTUDIANTE!B8,\"  \",FILIACION_ESTUDIANTE!C8,\"  \",FILIACION_ESTUDIANTE!D8)","v":"    "},null,null,null,null,null,null,null,null,null,null,null,null,null,null,null,null,null,null,null,null,null,"demuestra  algunas actitudes armonicas etre sfamilia Y  LE FALTAT",null,null,null,{"$f":"IF(C14=$AB$9,$AB$10,IF(C14=$AC$9,$AC$10,IF(C14=$AD$9,$AD$10,IF(C14=$AE$9,$AE$10))))","v":false},{"$f":"IF(D14=$AB$9,$AB$10,IF(D14=$AC$9,$AC$10,IF(D14=$AD$9,$AD$10,IF(D14=$AE$9,$AE$10))))","v":false},{"$f":"IF(E14=$AB$9,$AB$10,IF(E14=$AC$9,$AC$10,IF(E14=$AD$9,$AD$10,IF(E14=$AE$9,$AE$10))))","v":false},{"$f":"IF(F14=$AB$9,$AB$10,IF(F14=$AC$9,$AC$10,IF(F14=$AD$9,$AD$10,IF(F14=$AE$9,$AE$10))))","v":false},{"$f":"SUM(AB14:AE14)","v":0},{"$f":"IF(G14=$AB$9,$AB$10,IF(G14=$AC$9,$AC$10,IF(G14=$AD$9,$AD$10,IF(G14=$AE$9,$AE$10))))","v":false},{"$f":"IF(H14=$AB$9,$AB$10,IF(H14=$AC$9,$AC$10,IF(H14=$AD$9,$AD$10,IF(H14=$AE$9,$AE$10))))","v":false},{"$f":"IF(I14=$AB$9,$AB$10,IF(I14=$AC$9,$AC$10,IF(I14=$AD$9,$AD$10,IF(I14=$AE$9,$AE$10))))","v":false},{"$f":"IF(J14=$AB$9,$AB$10,IF(J14=$AC$9,$AC$10,IF(J14=$AD$9,$AD$10,IF(J14=$AE$9,$AE$10))))","v":false},{"$f":"SUM(AG14:AJ14)","v":0},{"$f":"IF(K14=$AB$9,$AB$10,IF(K14=$AC$9,$AC$10,IF(K14=$AD$9,$AD$10,IF(K14=$AE$9,$AE$10))))","v":false},{"$f":"IF(L14=$AB$9,$AB$10,IF(L14=$AC$9,$AC$10,IF(L14=$AD$9,$AD$10,IF(L14=$AE$9,$AE$10))))","v":false},{"$f":"IF(M14=$AB$9,$AB$10,IF(M14=$AC$9,$AC$10,IF(M14=$AD$9,$AD$10,IF(M14=$AE$9,$AE$10))))","v":false},{"$f":"IF(N14=$AB$9,$AB$10,IF(N14=$AC$9,$AC$10,IF(N14=$AD$9,$AD$10,IF(N14=$AE$9,$AE$10))))","v":false},{"$f":"SUM(AL14:AO14)","v":0},{"$f":"IF(O14=$AB$9,$AB$10,IF(O14=$AC$9,$AC$10,IF(O14=$AD$9,$AD$10,IF(O14=$AE$9,$AE$10))))","v":false},{"$f":"IF(P14=$AB$9,$AB$10,IF(P14=$AC$9,$AC$10,IF(P14=$AD$9,$AD$10,IF(P14=$AE$9,$AE$10))))","v":false},{"$f":"IF(Q14=$AB$9,$AB$10,IF(Q14=$AC$9,$AC$10,IF(Q14=$AD$9,$AD$10,IF(Q14=$AE$9,$AE$10))))","v":false},{"$f":"IF(R14=$AB$9,$AB$10,IF(R14=$AC$9,$AC$10,IF(R14=$AD$9,$AD$10,IF(R14=$AE$9,$AE$10))))","v":false},{"$f":"SUM(AQ14:AT14)","v":0},{"$f":"MAX(AF14,AK14,AP14,AU14)","v":0}]
[2,{"$f":"CONCATENATE(FILIACION_ESTUDIANTE!B9,\"  \",FILIACION_ESTUDIANTE!C9,\"  \",FILIACION_ESTUDIANTE!D9)","v":"    "}]
[3,{"$f":"CONCATENATE(FILIACION_ESTUDIANTE!B10,\"  \",FILIACION_ESTUDIANTE!C10,\"  \",FILIACION_ESTUDIANTE!D10)","v":"    "}]
[4,{"$f":"CONCATENATE(FILIACION_ESTUDIANTE!B11,\"  \",FILIACION_ESTUDIANTE!C11,\"  \",FILIACION_ESTUDIANTE!D11)","v":"    "}]
[5,{"$f":"CONCATENATE(FILIACION_ESTUDIANTE!B12,\"  \",FILIACION_ESTUDIANTE!C12,\"  \",FILIACION_ESTUDIANTE!D12)","v":"    "}]
[6,{"$f":"CONCATENATE(FILIACION_ESTUDIANTE!B13,\"  \",FILIACION_ESTUDIANTE!C13,\"  \",FILIACION_ESTUDIANTE!D13)","v":"    "}]
[7,{"$f":"CONCATENATE(FILIACION_ESTUDIANTE!B14,\"  \",FILIACION_ESTUDIANTE!C14,\"  \",FILIACION_ESTUDIANTE!D14)","v":"    "}]
[8,{"$f":"CONCATENATE(FILIACION_ESTUDIANTE!B15,\"  \",FILIACION_ESTUDIANTE!C15,\"  \",FILIACION_ESTUDIANTE!D15)","v":"    "}]
[9,{"$f":"CONCATENATE(FILIACION_ESTUDIANTE!B16,\"  \",FILIACION_ESTUDIANTE!C16,\"  \",FILIACION_ESTUDIANTE!D16)","v":"    "}]
[10,{"$f":"CONCATENATE(FILIACION_ESTUDIANTE!B17,\"  \",FILIACION_ESTUDIANTE!C17,\"  \",FILIACION_ESTUDIANTE!D17)","v":"    "}]
[11,{"$f":"CONCATENATE(FILIACION_ESTUDIANTE!B18,\"  \",FILIACION_ESTUDIANTE!C18,\"  \",FILIACION_ESTUDIANTE!D18)","v":"    "}]
[12,{"$f":"CONCATENATE(FILIACION_ESTUDIANTE!B19,\"  \",FILIACION_ESTUDIANTE!C19,\"  \",FILIACION_ESTUDIANTE!D19)","v":"    "}]
[13,{"$f":"CONCATENATE(FILIACION_ESTUDIANTE!B20,\"  \",FILIACION_ESTUDIANTE!C20,\"  \",FILIACION_ESTUDIANTE!D20)","v":"    "}]
[14,{"$f":"CONCATENATE(FILIACION_ESTUDIANTE!B21,\"  \",FILIACION_ESTUDIANTE!C21,\"  \",FILIACION_ESTUDIANTE!D21)","v":"    "}]
[15,{"$f":"CONCATENATE(FILIACION_ESTUDIANTE!B22,\"  \",FILIACION_ESTUDIANTE!C22,\"  \",FILIACION_ESTUDIANTE!D22)","v":"    "}]
[16,{"$f":"CONCATENATE(FILIACION_ESTUDIANTE!B23,\"  \",FILIACION_ESTUDIANTE!C23,\"  \",FILIACION_ESTUDIANTE!D23)","v":"    "}]
[17,{"$f":"CONCATENATE(FILIACION_ESTUDIANTE!B24,\"  \",FILIACION_ESTUDIANTE!C24,\"  \",FILIACION_ESTUDIANTE!D24)","v":"    "}]
[18,{"$f":"CONCATENATE(FILIACION_ESTUDIANTE!B25,\"  \",FILIACION_ESTUDIANTE!C25,\"  \",FILIACION_ESTUDIANTE!D25)","v":"    "}]
[19,{"$f":"CONCATENATE(FILIACION_ESTUDIANTE!B26,\"  \",FILIACION_ESTUDIANTE!C26,\"  \",FILIACION_ESTUDIANTE!D26)","v":"    "}]
[20,{"$f":"CONCATENATE(FILIACION_ESTUDIANTE!B27,\"  \",FILIACION_ESTUDIANTE!C27,\"  \",FILIACION_ESTUDIANTE!D27)","v":"    "}]
[21,{"$f":"CONCATENATE(FILIACION_ESTUDIANTE!B28,\"  \",FILIACION_ESTUDIANTE!C28,\"  \",FILIACION_ESTUDIANTE!D28)","v":"    "}]
[22,{"$f":"CONCATENATE(FILIACION_ESTUDIANTE!B29,\"  \",FILIACION_ESTUDIANTE!C29,\"  \",FILIACION_ESTUDIANTE!D29)","v":"    "}]
[23,{"$f":"CONCATENATE(FILIACION_ESTUDIANTE!B30,\"  \",FILIACION_ESTUDIANTE!C30,\"  \",FILIACION_ESTUDIANTE!D30)","v":"    "}]
[24,{"$f":"CONCATENATE(FILIACION_ESTUDIANTE!B31,\"  \",FILIACION_ESTUDIANTE!C31,\"  \",FILIACION_ESTUDIANTE!D31)","v":"    "}]
[25,{"$f":"CONCATENATE(FILIACION_ESTUDIANTE!B32,\"  \",FILIACION_ESTUDIANTE!C32,\"  \",FILIACION_ESTUDIANTE!D32)","v":"    "}]
[26,{"$f":"CONCATENATE(FILIACION_ESTUDIANTE!B33,\"  \",FILIACION_ESTUDIANTE!C33,\"  \",FILIACION_ESTUDIANTE!D33)","v":"    "}]
[27,{"$f":"CONCATENATE(FILIACION_ESTUDIANTE!B34,\"  \",FILIACION_ESTUDIANTE!C34,\"  \",FILIACION_ESTUDIANTE!D34)","v":"    "}]
[28,{"$f":"CONCATENATE(FILIACION_ESTUDIANTE!B35,\"  \",FILIACION_ESTUDIANTE!C35,\"  \",FILIACION_ESTUDIANTE!D35)","v":"    "}]
[29,{"$f":"CONCATENATE(FILIACION_ESTUDIANTE!B36,\"  \",FILIACION_ESTUDIANTE!C36,\"  \",FILIACION_ESTUDIANTE!D36)","v":"    "}]
[30,{"$f":"CONCATENATE(FILIACION_ESTUDIANTE!B37,\"  \",FILIACION_ESTUDIANTE!C37,\"  \",FILIACION_ESTUDIANTE!D37)","v":"    "}]
[31,{"$f":"CONCATENATE(FILIACION_ESTUDIANTE!B38,\"  \",FILIACION_ESTUDIANTE!C38,\"  \",FILIACION_ESTUDIANTE!D38)","v":"    "}]
[32,{"$f":"CONCATENATE(FILIACION_ESTUDIANTE!B39,\"  \",FILIACION_ESTUDIANTE!C39,\"  \",FILIACION_ESTUDIANTE!D39)","v":"    "}]
[33,{"$f":"CONCATENATE(FILIACION_ESTUDIANTE!B40,\"  \",FILIACION_ESTUDIANTE!C40,\"  \",FILIACION_ESTUDIANTE!D40)","v":"    "}]
[34,{"$f":"CONCATENATE(FILIACION_ESTUDIANTE!B41,\"  \",FILIACION_ESTUDIANTE!C41,\"  \",FILIACION_ESTUDIANTE!D41)","v":"    "}]
[35,{"$f":"CONCATENATE(FILIACION_ESTUDIANTE!B42,\"  \",FILIACION_ESTUDIANTE!C42,\"  \",FILIACION_ESTUDIANTE!D42)","v":"    "}]
[36,{"$f":"CONCATENATE(FILIACION_ESTUDIANTE!B43,\"  \",FILIACION_ESTUDIANTE!C43,\"  \",FILIACION_ESTUDIANTE!D43)","v":"    "}]
[37,{"$f":"CONCATENATE(FILIACION_ESTUDIANTE!B44,\"  \",FILIACION_ESTUDIANTE!C44,\"  \",FILIACION_ESTUDIANTE!D44)","v":"    "}]
[38,{"$f":"CONCATENATE(FILIACION_ESTUDIANTE!B45,\"  \",FILIACION_ESTUDIANTE!C45,\"  \",FILIACION_ESTUDIANTE!D45)","v":"    "}]
[39,{"$f":"CONCATENATE(FILIACION_ESTUDIANTE!B46,\"  \",FILIACION_ESTUDIANTE!C46,\"  \",FILIACION_ESTUDIANTE!D46)","v":"    "}]
[40,{"$f":"CONCATENATE(FILIACION_ESTUDIANTE!B47,\"  \",FILIACION_ESTUDIANTE!C47,\"  \",FILIACION_ESTUDIANTE!D47)","v":"    "}]

{"sheet":"CIENCIA_TEC_4B","index":32,"n_rows":53,"n_cols":48,"rows_kept":53,"cut":false,"hidden":false,"merged":[[11,14,12,14],[11,7,12,7],[11,8,12,8],[11,9,12,9],[11,10,12,10],[11,11,12,11],[11,2,12,2],[11,3,12,3],[11,4,12,4],[11,5,12,5],[11,6,12,6],[33,18,33,19],[34,18,34,19],[35,18,35,19],[36,18,36,19],[37,18,37,19],[38,18,38,19],[39,18,39,19],[40,18,40,19],[41,18,41,19],[42,18,42,19],[51,18,51,19],[52,18,52,19],[43,18,43,19],[44,18,44,19],[45,18,45,19],[46,18,46,19],[47,18,47,19],[48,18,48,19],[49,18,49,19],[50,18,50,19],[29,18,29,19],[30,18,30,19],[31,18,31,19],[32,18,32,19],[23,18,23,19],[24,18,24,19],[25,18,25,19],[26,18,26,19],[27,18,27,19],[28,18,28,19],[18,18,18,19],[19,18,19,19],[20,18,20,19],[21,18,21,19],[22,18,22,19],[13,18,13,19],[14,18,14,19],[15,18,15,19],[16,18,16,19],[17,18,17,19],[1,1,2,1],[1,2,1,19],[1,27,6,31],[2,2,2,19],[3,0,3,1],[3,2,3,11],[3,12,3,17],[3,18,3,20],[4,0,4,20],[5,0,5,1],[6,0,12,0],[6,2,6,5],[6,6,6,9],[6,10,6,13],[6,14,6,17],[5,2,5,20],[7,6,9,6],[7,7,9,7],[7,8,9,8],[7,9,9,9],[7,10,9,10],[7,1,9,1],[7,2,9,2],[7,3,9,3],[7,4,9,4],[7,5,9,5],[6,18,8,19],[7,11,9,11],[7,12,9,12],[7,14,9,14],[6,20,12,20],[7,13,9,13],[7,15,9,15],[7,16,9,16],[7,17,9,17],[11,15,12,15],[11,16,12,16],[11,17,12,17],[11,18,12,19],[10,18,10,19],[11,12,12,12],[11,13,12,13]]}
[]
[null,null,"CUADRO DE VALORACIÓN",null,null,null,null,null,null,null,null,null,null,null,null,null,null,null,null,null,null,null,null,null,null,null,null,"REGISTRO DE VALORACION",null,null,null,null,"ED",null,null,null,null,null,null,null,"DA","DO",null,"DP"]
[null,null,"EDUCACIÓN INICIAL  EN FAMILIA COMUNITARIA ",null,null,null,null,null,null,null,null,null,null,null,null,null,null,null,null,null,"4° BIMESTRE"]
[{"$f":"UPPER( CARATULA!$C$20)","v":"MAESTRA (O):"},null,{"$f":"CARATULA!$E$20","v":0},null,null,null,null,null,null,null,null,null,{"$f":"UPPER(CARATULA!$C$21)","v":"AÑO DE ESCOLARIDAD:"},null,null,null,null,null,{"$f":"CARATULA!$E$21","v":0}]
["CAMPO DE SABER Y CONOCIMIENTO -  CIENCIA TECNOLOGÍA Y PRODUCCIÓN "]
["EVALUACIÓN",null,"CRITERIOS DE LAS DIMENSIONES"]
["Nº","DIMENSIONES","SER",null,null,null,"SABER",null,null,null,"HACER",null,null,null,"DECIDIR",null,null,null,"AUTOEVALUACIÓN (SER, SABER, HACER, DECIDIR)",null,"SÍNTESIS CUALITATIVA DEL BIMESTRE"]
[null,"PLANES DE CLASE (PDC)","PDC","PDC","PDC","PDC","PDC","PDC","PDC","PDC","PDC","PDC","PDC","PDC","PDC","PDC","PDC","PDC"]
[null,null,null,null,null,null,null,null,null,null,null,null,null,null,null,null,null,null,null,null,null,null,null,null,null,null,null,"DP","DO","DA","ED"]
[null,null,null,null,null,null,null,null,null,null,null,null,null,null,null,null,null,null,null,null,null,null,null,null,null,null,null,14,8,5,1]
[null,"CRITERIOS DE EVALUACIÓN"]
[null,"INSTRUMENTOS Y/O ESTRATEGIAS DE EVALUACIÓN"]
[null,"APELLIDOS Y NOMBRES"]
[1,{"$f":"CONCATENATE(FILIACION_ESTUDIANTE!B8,\"  \",FILIACION_ESTUDIANTE!C8,\"  \",FILIACION_ESTUDIANTE!D8)","v":"    "},null,null,null,null,null,null,null,null,null,null,null,null,null,null,null,null,null,null,null,null,null,"demuestra  algunas actitudes armonicas etre sfamilia Y  LE FALTAT",null,null,null,{"$f":"IF(C14=$AB$9,$AB$10,IF(C14=$AC$9,$AC$10,IF(C14=$AD$9,$AD$10,IF(C14=$AE$9,$AE$10))))","v":false},{"$f":"IF(D14=$AB$9,$AB$10,IF(D14=$AC$9,$AC$10,IF(D14=$AD$9,$AD$10,IF(D14=$AE$9,$AE$10))))","v":false},{"$f":"IF(E14=$AB$9,$AB$10,IF(E14=$AC$9,$AC$10,IF(E14=$AD$9,$AD$10,IF(E14=$AE$9,$AE$10))))","v":false},{"$f":"IF(F14=$AB$9,$AB$10,IF(F14=$AC$9,$AC$10,IF(F14=$AD$9,$AD$10,IF(F14=$AE$9,$AE$10))))","v":false},{"$f":"SUM(AB14:AE14)","v":0},{"$f":"IF(G14=$AB$9,$AB$10,IF(G14=$AC$9,$AC$10,IF(G14=$AD$9,$AD$10,IF(G14=$AE$9,$AE$10))))","v":false},{"$f":"IF(H14=$AB$9,$AB$10,IF(H14=$AC$9,$AC$10,IF(H14=$AD$9,$AD$10,IF(H14=$AE$9,$AE$10))))","v":false},{"$f":"IF(I14=$AB$9,$AB$10,IF(I14=$AC$9,$AC$10,IF(I14=$AD$9,$AD$10,IF(I14=$AE$9,$AE$10))))","v":false},{"$f":"IF(J14=$AB$9,$AB$10,IF(J14=$AC$9,$AC$10,IF(J14=$AD$9,$AD$10,IF(J14=$AE$9,$AE$10))))","v":false},{"$f":"SUM(AG14:AJ14)","v":0},{"$f":"IF(K14=$AB$9,$AB$10,IF(K14=$AC$9,$AC$10,IF(K14=$AD$9,$AD$10,IF(K14=$AE$9,$AE$10))))","v":false},{"$f":"IF(L14=$AB$9,$AB$10,IF(L14=$AC$9,$AC$10,IF(L14=$AD$9,$AD$10,IF(L14=$AE$9,$AE$10))))","v":false},{"$f":"IF(M14=$AB$9,$AB$10,IF(M14=$AC$9,$AC$10,IF(M14=$AD$9,$AD$10,IF(M14=$AE$9,$AE$10))))","v":false},{"$f":"IF(N14=$AB$9,$AB$10,IF(N14=$AC$9,$AC$10,IF(N14=$AD$9,$AD$10,IF(N14=$AE$9,$AE$10))))","v":false},{"$f":"SUM(AL14:AO14)","v":0},{"$f":"IF(O14=$AB$9,$AB$10,IF(O14=$AC$9,$AC$10,IF(O14=$AD$9,$AD$10,IF(O14=$AE$9,$AE$10))))","v":false},{"$f":"IF(P14=$AB$9,$AB$10,IF(P14=$AC$9,$AC$10,IF(P14=$AD$9,$AD$10,IF(P14=$AE$9,$AE$10))))","v":false},{"$f":"IF(Q14=$AB$9,$AB$10,IF(Q14=$AC$9,$AC$10,IF(Q14=$AD$9,$AD$10,IF(Q14=$AE$9,$AE$10))))","v":false},{"$f":"IF(R14=$AB$9,$AB$10,IF(R14=$AC$9,$AC$10,IF(R14=$AD$9,$AD$10,IF(R14=$AE$9,$AE$10))))","v":false},{"$f":"SUM(AQ14:AT14)","v":0},{"$f":"MAX(AF14,AK14,AP14,AU14)","v":0}]
[2,{"$f":"CONCATENATE(FILIACION_ESTUDIANTE!B9,\"  \",FILIACION_ESTUDIANTE!C9,\"  \",FILIACION_ESTUDIANTE!D9)","v":"    "}]
[3,{"$f":"CONCATENATE(FILIACION_ESTUDIANTE!B10,\"  \",FILIACION_ESTUDIANTE!C10,\"  \",FILIACION_ESTUDIANTE!D10)","v":"    "}]
[4,{"$f":"CONCATENATE(FILIACION_ESTUDIANTE!B11,\"  \",FILIACION_ESTUDIANTE!C11,\"  \",FILIACION_ESTUDIANTE!D11)","v":"    "}]
[5,{"$f":"CONCATENATE(FILIACION_ESTUDIANTE!B12,\"  \",FILIACION_ESTUDIANTE!C12,\"  \",FILIACION_ESTUDIANTE!D12)","v":"    "}]
[6,{"$f":"CONCATENATE(FILIACION_ESTUDIANTE!B13,\"  \",FILIACION_ESTUDIANTE!C13,\"  \",FILIACION_ESTUDIANTE!D13)","v":"    "}]
[7,{"$f":"CONCATENATE(FILIACION_ESTUDIANTE!B14,\"  \",FILIACION_ESTUDIANTE!C14,\"  \",FILIACION_ESTUDIANTE!D14)","v":"    "}]
[8,{"$f":"CONCATENATE(FILIACION_ESTUDIANTE!B15,\"  \",FILIACION_ESTUDIANTE!C15,\"  \",FILIACION_ESTUDIANTE!D15)","v":"    "}]
[9,{"$f":"CONCATENATE(FILIACION_ESTUDIANTE!B16,\"  \",FILIACION_ESTUDIANTE!C16,\"  \",FILIACION_ESTUDIANTE!D16)","v":"    "}]
[10,{"$f":"CONCATENATE(FILIACION_ESTUDIANTE!B17,\"  \",FILIACION_ESTUDIANTE!C17,\"  \",FILIACION_ESTUDIANTE!D17)","v":"    "}]
[11,{"$f":"CONCATENATE(FILIACION_ESTUDIANTE!B18,\"  \",FILIACION_ESTUDIANTE!C18,\"  \",FILIACION_ESTUDIANTE!D18)","v":"    "}]
[12,{"$f":"CONCATENATE(FILIACION_ESTUDIANTE!B19,\"  \",FILIACION_ESTUDIANTE!C19,\"  \",FILIACION_ESTUDIANTE!D19)","v":"    "}]
[13,{"$f":"CONCATENATE(FILIACION_ESTUDIANTE!B20,\"  \",FILIACION_ESTUDIANTE!C20,\"  \",FILIACION_ESTUDIANTE!D20)","v":"    "}]
[14,{"$f":"CONCATENATE(FILIACION_ESTUDIANTE!B21,\"  \",FILIACION_ESTUDIANTE!C21,\"  \",FILIACION_ESTUDIANTE!D21)","v":"    "}]
[15,{"$f":"CONCATENATE(FILIACION_ESTUDIANTE!B22,\"  \",FILIACION_ESTUDIANTE!C22,\"  \",FILIACION_ESTUDIANTE!D22)","v":"    "}]
[16,{"$f":"CONCATENATE(FILIACION_ESTUDIANTE!B23,\"  \",FILIACION_ESTUDIANTE!C23,\"  \",FILIACION_ESTUDIANTE!D23)","v":"    "}]
[17,{"$f":"CONCATENATE(FILIACION_ESTUDIANTE!B24,\"  \",FILIACION_ESTUDIANTE!C24,\"  \",FILIACION_ESTUDIANTE!D24)","v":"    "}]
[18,{"$f":"CONCATENATE(FILIACION_ESTUDIANTE!B25,\"  \",FILIACION_ESTUDIANTE!C25,\"  \",FILIACION_ESTUDIANTE!D25)","v":"    "}]
[19,{"$f":"CONCATENATE(FILIACION_ESTUDIANTE!B26,\"  \",FILIACION_ESTUDIANTE!C26,\"  \",FILIACION_ESTUDIANTE!D26)","v":"    "}]
[20,{"$f":"CONCATENATE(FILIACION_ESTUDIANTE!B27,\"  \",FILIACION_ESTUDIANTE!C27,\"  \",FILIACION_ESTUDIANTE!D27)","v":"    "}]
[21,{"$f":"CONCATENATE(FILIACION_ESTUDIANTE!B28,\"  \",FILIACION_ESTUDIANTE!C28,\"  \",FILIACION_ESTUDIANTE!D28)","v":"    "}]
[22,{"$f":"CONCATENATE(FILIACION_ESTUDIANTE!B29,\"  \",FILIACION_ESTUDIANTE!C29,\"  \",FILIACION_ESTUDIANTE!D29)","v":"    "}]
[23,{"$f":"CONCATENATE(FILIACION_ESTUDIANTE!B30,\"  \",FILIACION_ESTUDIANTE!C30,\"  \",FILIACION_ESTUDIANTE!D30)","v":"    "}]
[24,{"$f":"CONCATENATE(FILIACION_ESTUDIANTE!B31,\"  \",FILIACION_ESTUDIANTE!C31,\"  \",FILIACION_ESTUDIANTE!D31)","v":"    "}]
[25,{"$f":"CONCATENATE(FILIACION_ESTUDIANTE!B32,\"  \",FILIACION_ESTUDIANTE!C32,\"  \",FILIACION_ESTUDIANTE!D32)","v":"    "}]
[26,{"$f":"CONCATENATE(FILIACION_ESTUDIANTE!B33,\"  \",FILIACION_ESTUDIANTE!C33,\"  \",FILIACION_ESTUDIANTE!D33)","v":"    "}]
[27,{"$f":"CONCATENATE(FILIACION_ESTUDIANTE!B34,\"  \",FILIACION_ESTUDIANTE!C34,\"  \",FILIACION_ESTUDIANTE!D34)","v":"    "}]
[28,{"$f":"CONCATENATE(FILIACION_ESTUDIANTE!B35,\"  \",FILIACION_ESTUDIANTE!C35,\"  \",FILIACION_ESTUDIANTE!D35)","v":"    "}]
[29,{"$f":"CONCATENATE(FILIACION_ESTUDIANTE!B36,\"  \",FILIACION_ESTUDIANTE!C36,\"  \",FILIACION_ESTUDIANTE!D36)","v":"    "}]
[30,{"$f":"CONCATENATE(FILIACION_ESTUDIANTE!B37,\"  \",FILIACION_ESTUDIANTE!C37,\"  \",FILIACION_ESTUDIANTE!D37)","v":"    "}]
[31,{"$f":"CONCATENATE(FILIACION_ESTUDIANTE!B38,\"  \",FILIACION_ESTUDIANTE!C38,\"  \",FILIACION_ESTUDIANTE!D38)","v":"    "}]
[32,{"$f":"CONCATENATE(FILIACION_ESTUDIANTE!B39,\"  \",FILIACION_ESTUDIANTE!C39,\"  \",FILIACION_ESTUDIANTE!D39)","v":"    "}]
[33,{"$f":"CONCATENATE(FILIACION_ESTUDIANTE!B40,\"  \",FILIACION_ESTUDIANTE!C40,\"  \",FILIACION_ESTUDIANTE!D40)","v":"    "}]
[34,{"$f":"CONCATENATE(FILIACION_ESTUDIANTE!B41,\"  \",FILIACION_ESTUDIANTE!C41,\"  \",FILIACION_ESTUDIANTE!D41)","v":"    "}]
[35,{"$f":"CONCATENATE(FILIACION_ESTUDIANTE!B42,\"  \",FILIACION_ESTUDIANTE!C42,\"  \",FILIACION_ESTUDIANTE!D42)","v":"    "}]
[36,{"$f":"CONCATENATE(FILIACION_ESTUDIANTE!B43,\"  \",FILIACION_ESTUDIANTE!C43,\"  \",FILIACION_ESTUDIANTE!D43)","v":"    "}]
[37,{"$f":"CONCATENATE(FILIACION_ESTUDIANTE!B44,\"  \",FILIACION_ESTUDIANTE!C44,\"  \",FILIACION_ESTUDIANTE!D44)","v":"    "}]
[38,{"$f":"CONCATENATE(FILIACION_ESTUDIANTE!B45,\"  \",FILIACION_ESTUDIANTE!C45,\"  \",FILIACION_ESTUDIANTE!D45)","v":"    "}]
[39,{"$f":"CONCATENATE(FILIACION_ESTUDIANTE!B46,\"  \",FILIACION_ESTUDIANTE!C46,\"  \",FILIACION_ESTUDIANTE!D46)","v":"    "}]
[40,{"$f":"CONCATENATE(FILIACION_ESTUDIANTE!B47,\"  \",FILIACION_ESTUDIANTE!C47,\"  \",FILIACION_ESTUDIANTE!D47)","v":"    "}]

{"sheet":"VIDA_TIERRA_1B","index":33,"n_rows":53,"n_cols":48,"rows_kept":53,"cut":false,"hidden":false,"merged":[[11,14,12,14],[11,7,12,7],[11,8,12,8],[11,9,12,9],[11,10,12,10],[11,11,12,11],[11,2,12,2],[11,3,12,3],[11,4,12,4],[11,5,12,5],[11,6,12,6],[33,18,33,19],[34,18,34,19],[35,18,35,19],[36,18,36,19],[37,18,37,19],[38,18,38,19],[39,18,39,19],[40,18,40,19],[41,18,41,19],[42,18,42,19],[51,18,51,19],[52,18,52,19],[43,18,43,19],[44,18,44,19],[45,18,45,19],[46,18,46,19],[47,18,47,19],[48,18,48,19],[49,18,49,19],[50,18,50,19],[29,18,29,19],[30,18,30,19],[31,18,31,19],[32,18,32,19],[23,18,23,19],[24,18,24,19],[25,18,25,19],[26,18,26,19],[27,18,27,19],[28,18,28,19],[18,18,18,19],[19,18,19,19],[20,18,20,19],[21,18,21,19],[22,18,22,19],[13,18,13,19],[14,18,14,19],[15,18,15,19],[16,18,16,19],[17,18,17,19],[1,1,2,1],[1,2,1,19],[1,27,6,31],[2,2,2,19],[3,0,3,1],[3,2,3,11],[3,12,3,17],[3,18,3,20],[4,0,4,20],[5,0,5,1],[6,0,12,0],[6,2,6,5],[6,6,6,9],[6,10,6,13],[6,14,6,17],[5,2,5,20],[7,6,9,6],[7,7,9,7],[7,8,9,8],[7,9,9,9],[7,10,9,10],[7,1,9,1],[7,2,9,2],[7,3,9,3],[7,4,9,4],[7,5,9,5],[6,18,8,19],[7,11,9,11],[7,12,9,12],[7,14,9,14],[6,20,12,20],[7,13,9,13],[7,15,9,15],[7,16,9,16],[7,17,9,17],[11,15,12,15],[11,16,12,16],[11,17,12,17],[11,18,12,19],[10,18,10,19],[11,12,12,12],[11,13,12,13]]}
[]
[null,null,"CUADRO DE VALORACIÓN",null,null,null,null,null,null,null,null,null,null,null,null,null,null,null,null,null,null,null,null,null,null,null,null,"REGISTRO DE VALORACION",null,null,null,null,"ED",null,null,null,null,null,null,null,"DA","DO",null,"DP"]
[null,null,"EDUCACIÓN INICIAL  EN FAMILIA COMUNITARIA ",null,null,null,null,null,null,null,null,null,null,null,null,null,null,null,null,null,"1er BIMESTRE"]
[{"$f":"UPPER( CARATULA!$C$20)","v":"MAESTRA (O):"},null,{"$f":"CARATULA!$E$20","v":0},null,null,null,null,null,null,null,null,null,{"$f":"UPPER(CARATULA!$C$21)","v":"AÑO DE ESCOLARIDAD:"},null,null,null,null,null,{"$f":"CARATULA!$E$21","v":0}]
["CAMPO DE SABER Y CONOCIMIENTO -  VIDA TIERRA Y TERRITORIO"]
["EVALUACIÓN",null,"CRITERIOS DE LAS DIMENSIONES"]
["Nº","DIMENSIONES","SER",null,null,null,"SABER",null,null,null,"HACER",null,null,null,"DECIDIR",null,null,null,"AUTOEVALUACIÓN (SER, SABER, HACER, DECIDIR)",null,"SÍNTESIS CUALITATIVA DEL BIMESTRE"]
[null,"PLANES DE CLASE (PDC)","PDC","PDC","PDC","PDC","PDC","PDC","PDC","PDC","PDC","PDC","PDC","PDC","PDC","PDC","PDC","PDC"]
[null,null,null,null,null,null,null,null,null,null,null,null,null,null,null,null,null,null,null,null,null,null,null,null,null,null,null,"DP","DO","DA","ED"]
[null,null,null,null,null,null,null,null,null,null,null,null,null,null,null,null,null,null,null,null,null,null,null,null,null,null,null,14,8,5,1]
[null,"CRITERIOS DE EVALUACIÓN"]
[null,"INSTRUMENTOS Y/O ESTRATEGIAS DE EVALUACIÓN"]
[null,"APELLIDOS Y NOMBRES"]
[1,{"$f":"CONCATENATE(FILIACION_ESTUDIANTE!B8,\"  \",FILIACION_ESTUDIANTE!C8,\"  \",FILIACION_ESTUDIANTE!D8)","v":"    "},null,null,null,null,null,null,null,null,null,null,null,null,null,null,null,null,null,null,null,null,null,"demuestra  algunas actitudes armonicas etre sfamilia Y  LE FALTAT",null,null,null,{"$f":"IF(C14=$AB$9,$AB$10,IF(C14=$AC$9,$AC$10,IF(C14=$AD$9,$AD$10,IF(C14=$AE$9,$AE$10))))","v":false},{"$f":"IF(D14=$AB$9,$AB$10,IF(D14=$AC$9,$AC$10,IF(D14=$AD$9,$AD$10,IF(D14=$AE$9,$AE$10))))","v":false},{"$f":"IF(E14=$AB$9,$AB$10,IF(E14=$AC$9,$AC$10,IF(E14=$AD$9,$AD$10,IF(E14=$AE$9,$AE$10))))","v":false},{"$f":"IF(F14=$AB$9,$AB$10,IF(F14=$AC$9,$AC$10,IF(F14=$AD$9,$AD$10,IF(F14=$AE$9,$AE$10))))","v":false},{"$f":"SUM(AB14:AE14)","v":0},{"$f":"IF(G14=$AB$9,$AB$10,IF(G14=$AC$9,$AC$10,IF(G14=$AD$9,$AD$10,IF(G14=$AE$9,$AE$10))))","v":false},{"$f":"IF(H14=$AB$9,$AB$10,IF(H14=$AC$9,$AC$10,IF(H14=$AD$9,$AD$10,IF(H14=$AE$9,$AE$10))))","v":false},{"$f":"IF(I14=$AB$9,$AB$10,IF(I14=$AC$9,$AC$10,IF(I14=$AD$9,$AD$10,IF(I14=$AE$9,$AE$10))))","v":false},{"$f":"IF(J14=$AB$9,$AB$10,IF(J14=$AC$9,$AC$10,IF(J14=$AD$9,$AD$10,IF(J14=$AE$9,$AE$10))))","v":false},{"$f":"SUM(AG14:AJ14)","v":0},{"$f":"IF(K14=$AB$9,$AB$10,IF(K14=$AC$9,$AC$10,IF(K14=$AD$9,$AD$10,IF(K14=$AE$9,$AE$10))))","v":false},{"$f":"IF(L14=$AB$9,$AB$10,IF(L14=$AC$9,$AC$10,IF(L14=$AD$9,$AD$10,IF(L14=$AE$9,$AE$10))))","v":false},{"$f":"IF(M14=$AB$9,$AB$10,IF(M14=$AC$9,$AC$10,IF(M14=$AD$9,$AD$10,IF(M14=$AE$9,$AE$10))))","v":false},{"$f":"IF(N14=$AB$9,$AB$10,IF(N14=$AC$9,$AC$10,IF(N14=$AD$9,$AD$10,IF(N14=$AE$9,$AE$10))))","v":false},{"$f":"SUM(AL14:AO14)","v":0},{"$f":"IF(O14=$AB$9,$AB$10,IF(O14=$AC$9,$AC$10,IF(O14=$AD$9,$AD$10,IF(O14=$AE$9,$AE$10))))","v":false},{"$f":"IF(P14=$AB$9,$AB$10,IF(P14=$AC$9,$AC$10,IF(P14=$AD$9,$AD$10,IF(P14=$AE$9,$AE$10))))","v":false},{"$f":"IF(Q14=$AB$9,$AB$10,IF(Q14=$AC$9,$AC$10,IF(Q14=$AD$9,$AD$10,IF(Q14=$AE$9,$AE$10))))","v":false},{"$f":"IF(R14=$AB$9,$AB$10,IF(R14=$AC$9,$AC$10,IF(R14=$AD$9,$AD$10,IF(R14=$AE$9,$AE$10))))","v":false},{"$f":"SUM(AQ14:AT14)","v":0},{"$f":"MAX(AF14,AK14,AP14,AU14)","v":0}]
[2,{"$f":"CONCATENATE(FILIACION_ESTUDIANTE!B9,\"  \",FILIACION_ESTUDIANTE!C9,\"  \",FILIACION_ESTUDIANTE!D9)","v":"    "}]
[3,{"$f":"CONCATENATE(FILIACION_ESTUDIANTE!B10,\"  \",FILIACION_ESTUDIANTE!C10,\"  \",FILIACION_ESTUDIANTE!D10)","v":"    "}]
[4,{"$f":"CONCATENATE(FILIACION_ESTUDIANTE!B11,\"  \",FILIACION_ESTUDIANTE!C11,\"  \",FILIACION_ESTUDIANTE!D11)","v":"    "}]
[5,{"$f":"CONCATENATE(FILIACION_ESTUDIANTE!B12,\"  \",FILIACION_ESTUDIANTE!C12,\"  \",FILIACION_ESTUDIANTE!D12)","v":"    "}]
[6,{"$f":"CONCATENATE(FILIACION_ESTUDIANTE!B13,\"  \",FILIACION_ESTUDIANTE!C13,\"  \",FILIACION_ESTUDIANTE!D13)","v":"    "}]
[7,{"$f":"CONCATENATE(FILIACION_ESTUDIANTE!B14,\"  \",FILIACION_ESTUDIANTE!C14,\"  \",FILIACION_ESTUDIANTE!D14)","v":"    "}]
[8,{"$f":"CONCATENATE(FILIACION_ESTUDIANTE!B15,\"  \",FILIACION_ESTUDIANTE!C15,\"  \",FILIACION_ESTUDIANTE!D15)","v":"    "}]
[9,{"$f":"CONCATENATE(FILIACION_ESTUDIANTE!B16,\"  \",FILIACION_ESTUDIANTE!C16,\"  \",FILIACION_ESTUDIANTE!D16)","v":"    "}]
[10,{"$f":"CONCATENATE(FILIACION_ESTUDIANTE!B17,\"  \",FILIACION_ESTUDIANTE!C17,\"  \",FILIACION_ESTUDIANTE!D17)","v":"    "}]
[11,{"$f":"CONCATENATE(FILIACION_ESTUDIANTE!B18,\"  \",FILIACION_ESTUDIANTE!C18,\"  \",FILIACION_ESTUDIANTE!D18)","v":"    "}]
[12,{"$f":"CONCATENATE(FILIACION_ESTUDIANTE!B19,\"  \",FILIACION_ESTUDIANTE!C19,\"  \",FILIACION_ESTUDIANTE!D19)","v":"    "}]
[13,{"$f":"CONCATENATE(FILIACION_ESTUDIANTE!B20,\"  \",FILIACION_ESTUDIANTE!C20,\"  \",FILIACION_ESTUDIANTE!D20)","v":"    "}]
[14,{"$f":"CONCATENATE(FILIACION_ESTUDIANTE!B21,\"  \",FILIACION_ESTUDIANTE!C21,\"  \",FILIACION_ESTUDIANTE!D21)","v":"    "}]
[15,{"$f":"CONCATENATE(FILIACION_ESTUDIANTE!B22,\"  \",FILIACION_ESTUDIANTE!C22,\"  \",FILIACION_ESTUDIANTE!D22)","v":"    "}]
[16,{"$f":"CONCATENATE(FILIACION_ESTUDIANTE!B23,\"  \",FILIACION_ESTUDIANTE!C23,\"  \",FILIACION_ESTUDIANTE!D23)","v":"    "}]
[17,{"$f":"CONCATENATE(FILIACION_ESTUDIANTE!B24,\"  \",FILIACION_ESTUDIANTE!C24,\"  \",FILIACION_ESTUDIANTE!D24)","v":"    "}]
[18,{"$f":"CONCATENATE(FILIACION_ESTUDIANTE!B25,\"  \",FILIACION_ESTUDIANTE!C25,\"  \",FILIACION_ESTUDIANTE!D25)","v":"    "}]
[19,{"$f":"CONCATENATE(FILIACION_ESTUDIANTE!B26,\"  \",FILIACION_ESTUDIANTE!C26,\"  \",FILIACION_ESTUDIANTE!D26)","v":"    "}]
[20,{"$f":"CONCATENATE(FILIACION_ESTUDIANTE!B27,\"  \",FILIACION_ESTUDIANTE!C27,\"  \",FILIACION_ESTUDIANTE!D27)","v":"    "}]
[21,{"$f":"CONCATENATE(FILIACION_ESTUDIANTE!B28,\"  \",FILIACION_ESTUDIANTE!C28,\"  \",FILIACION_ESTUDIANTE!D28)","v":"    "}]
[22,{"$f":"CONCATENATE(FILIACION_ESTUDIANTE!B29,\"  \",FILIACION_ESTUDIANTE!C29,\"  \",FILIACION_ESTUDIANTE!D29)","v":"    "}]
[23,{"$f":"CONCATENATE(FILIACION_ESTUDIANTE!B30,\"  \",FILIACION_ESTUDIANTE!C30,\"  \",FILIACION_ESTUDIANTE!D30)","v":"    "}]
[24,{"$f":"CONCATENATE(FILIACION_ESTUDIANTE!B31,\"  \",FILIACION_ESTUDIANTE!C31,\"  \",FILIACION_ESTUDIANTE!D31)","v":"    "}]
[25,{"$f":"CONCATENATE(FILIACION_ESTUDIANTE!B32,\"  \",FILIACION_ESTUDIANTE!C32,\"  \",FILIACION_ESTUDIANTE!D32)","v":"    "}]
[26,{"$f":"CONCATENATE(FILIACION_ESTUDIANTE!B33,\"  \",FILIACION_ESTUDIANTE!C33,\"  \",FILIACION_ESTUDIANTE!D33)","v":"    "}]
[27,{"$f":"CONCATENATE(FILIACION_ESTUDIANTE!B34,\"  \",FILIACION_ESTUDIANTE!C34,\"  \",FILIACION_ESTUDIANTE!D34)","v":"    "}]
[28,{"$f":"CONCATENATE(FILIACION_ESTUDIANTE!B35,\"  \",FILIACION_ESTUDIANTE!C35,\"  \",FILIACION_ESTUDIANTE!D35)","v":"    "}]
[29,{"$f":"CONCATENATE(FILIACION_ESTUDIANTE!B36,\"  \",FILIACION_ESTUDIANTE!C36,\"  \",FILIACION_ESTUDIANTE!D36)","v":"    "}]
[30,{"$f":"CONCATENATE(FILIACION_ESTUDIANTE!B37,\"  \",FILIACION_ESTUDIANTE!C37,\"  \",FILIACION_ESTUDIANTE!D37)","v":"    "}]
[31,{"$f":"CONCATENATE(FILIACION_ESTUDIANTE!B38,\"  \",FILIACION_ESTUDIANTE!C38,\"  \",FILIACION_ESTUDIANTE!D38)","v":"    "}]
[32,{"$f":"CONCATENATE(FILIACION_ESTUDIANTE!B39,\"  \",FILIACION_ESTUDIANTE!C39,\"  \",FILIACION_ESTUDIANTE!D39)","v":"    "}]
[33,{"$f":"CONCATENATE(FILIACION_ESTUDIANTE!B40,\"  \",FILIACION_ESTUDIANTE!C40,\"  \",FILIACION_ESTUDIANTE!D40)","v":"    "}]
[34,{"$f":"CONCATENATE(FILIACION_ESTUDIANTE!B41,\"  \",FILIACION_ESTUDIANTE!C41,\"  \",FILIACION_ESTUDIANTE!D41)","v":"    "}]
[35,{"$f":"CONCATENATE(FILIACION_ESTUDIANTE!B42,\"  \",FILIACION_ESTUDIANTE!C42,\"  \",FILIACION_ESTUDIANTE!D42)","v":"    "}]
[36,{"$f":"CONCATENATE(FILIACION_ESTUDIANTE!B43,\"  \",FILIACION_ESTUDIANTE!C43,\"  \",FILIACION_ESTUDIANTE!D43)","v":"    "}]
[37,{"$f":"CONCATENATE(FILIACION_ESTUDIANTE!B44,\"  \",FILIACION_ESTUDIANTE!C44,\"  \",FILIACION_ESTUDIANTE!D44)","v":"    "}]
[38,{"$f":"CONCATENATE(FILIACION_ESTUDIANTE!B45,\"  \",FILIACION_ESTUDIANTE!C45,\"  \",FILIACION_ESTUDIANTE!D45)","v":"    "}]
[39,{"$f":"CONCATENATE(FILIACION_ESTUDIANTE!B46,\"  \",FILIACION_ESTUDIANTE!C46,\"  \",FILIACION_ESTUDIANTE!D46)","v":"    "}]
[40,{"$f":"CONCATENATE(FILIACION_ESTUDIANTE!B47,\"  \",FILIACION_ESTUDIANTE!C47,\"  \",FILIACION_ESTUDIANTE!D47)","v":"    "}]

{"sheet":"VIDA_TIERRA_2B","index":34,"n_rows":53,"n_cols":48,"rows_kept":53,"cut":false,"hidden":false,"merged":[[11,14,12,14],[11,7,12,7],[11,8,12,8],[11,9,12,9],[11,10,12,10],[11,11,12,11],[11,2,12,2],[11,3,12,3],[11,4,12,4],[11,5,12,5],[11,6,12,6],[33,18,33,19],[34,18,34,19],[35,18,35,19],[36,18,36,19],[37,18,37,19],[38,18,38,19],[39,18,39,19],[40,18,40,19],[41,18,41,19],[42,18,42,19],[51,18,51,19],[52,18,52,19],[43,18,43,19],[44,18,44,19],[45,18,45,19],[46,18,46,19],[47,18,47,19],[48,18,48,19],[49,18,49,19],[50,18,50,19],[29,18,29,19],[30,18,30,19],[31,18,31,19],[32,18,32,19],[23,18,23,19],[24,18,24,19],[25,18,25,19],[26,18,26,19],[27,18,27,19],[28,18,28,19],[18,18,18,19],[19,18,19,19],[20,18,20,19],[21,18,21,19],[22,18,22,19],[13,18,13,19],[14,18,14,19],[15,18,15,19],[16,18,16,19],[17,18,17,19],[1,1,2,1],[1,2,1,19],[1,27,6,31],[2,2,2,19],[3,0,3,1],[3,2,3,11],[3,12,3,17],[3,18,3,20],[4,0,4,20],[5,0,5,1],[6,0,12,0],[6,2,6,5],[6,6,6,9],[6,10,6,13],[6,14,6,17],[5,2,5,20],[7,6,9,6],[7,7,9,7],[7,8,9,8],[7,9,9,9],[7,10,9,10],[7,1,9,1],[7,2,9,2],[7,3,9,3],[7,4,9,4],[7,5,9,5],[6,18,8,19],[7,11,9,11],[7,12,9,12],[7,14,9,14],[6,20,12,20],[7,13,9,13],[7,15,9,15],[7,16,9,16],[7,17,9,17],[11,15,12,15],[11,16,12,16],[11,17,12,17],[11,18,12,19],[10,18,10,19],[11,12,12,12],[11,13,12,13]]}
[]
[null,null,"CUADRO DE VALORACIÓN",null,null,null,null,null,null,null,null,null,null,null,null,null,null,null,null,null,null,null,null,null,null,null,null,"REGISTRO DE VALORACION",null,null,null,null,"ED",null,null,null,null,null,null,null,"DA","DO",null,"DP"]
[null,null,"EDUCACIÓN INICIAL  EN FAMILIA COMUNITARIA ",null,null,null,null,null,null,null,null,null,null,null,null,null,null,null,null,null,"2° BIMESTRE"]
[{"$f":"UPPER( CARATULA!$C$20)","v":"MAESTRA (O):"},null,{"$f":"CARATULA!$E$20","v":0},null,null,null,null,null,null,null,null,null,{"$f":"UPPER(CARATULA!$C$21)","v":"AÑO DE ESCOLARIDAD:"},null,null,null,null,null,{"$f":"CARATULA!$E$21","v":0}]
["CAMPO DE SABER Y CONOCIMIENTO -  VIDA TIERRA Y TERRITORIO"]
["EVALUACIÓN",null,"CRITERIOS DE LAS DIMENSIONES"]
["Nº","DIMENSIONES","SER",null,null,null,"SABER",null,null,null,"HACER",null,null,null,"DECIDIR",null,null,null,"AUTOEVALUACIÓN (SER, SABER, HACER, DECIDIR)",null,"SÍNTESIS CUALITATIVA DEL BIMESTRE"]
[null,"PLANES DE CLASE (PDC)","PDC","PDC","PDC","PDC","PDC","PDC","PDC","PDC","PDC","PDC","PDC","PDC","PDC","PDC","PDC","PDC"]
[null,null,null,null,null,null,null,null,null,null,null,null,null,null,null,null,null,null,null,null,null,null,null,null,null,null,null,"DP","DO","DA","ED"]
[null,null,null,null,null,null,null,null,null,null,null,null,null,null,null,null,null,null,null,null,null,null,null,null,null,null,null,14,8,5,1]
[null,"CRITERIOS DE EVALUACIÓN"]
[null,"INSTRUMENTOS Y/O ESTRATEGIAS DE EVALUACIÓN"]
[null,"APELLIDOS Y NOMBRES"]
[1,{"$f":"CONCATENATE(FILIACION_ESTUDIANTE!B8,\"  \",FILIACION_ESTUDIANTE!C8,\"  \",FILIACION_ESTUDIANTE!D8)","v":"    "},null,null,null,null,null,null,null,null,null,null,null,null,null,null,null,null,null,null,null,null,null,"demuestra  algunas actitudes armonicas etre sfamilia Y  LE FALTAT",null,null,null,{"$f":"IF(C14=$AB$9,$AB$10,IF(C14=$AC$9,$AC$10,IF(C14=$AD$9,$AD$10,IF(C14=$AE$9,$AE$10))))","v":false},{"$f":"IF(D14=$AB$9,$AB$10,IF(D14=$AC$9,$AC$10,IF(D14=$AD$9,$AD$10,IF(D14=$AE$9,$AE$10))))","v":false},{"$f":"IF(E14=$AB$9,$AB$10,IF(E14=$AC$9,$AC$10,IF(E14=$AD$9,$AD$10,IF(E14=$AE$9,$AE$10))))","v":false},{"$f":"IF(F14=$AB$9,$AB$10,IF(F14=$AC$9,$AC$10,IF(F14=$AD$9,$AD$10,IF(F14=$AE$9,$AE$10))))","v":false},{"$f":"SUM(AB14:AE14)","v":0},{"$f":"IF(G14=$AB$9,$AB$10,IF(G14=$AC$9,$AC$10,IF(G14=$AD$9,$AD$10,IF(G14=$AE$9,$AE$10))))","v":false},{"$f":"IF(H14=$AB$9,$AB$10,IF(H14=$AC$9,$AC$10,IF(H14=$AD$9,$AD$10,IF(H14=$AE$9,$AE$10))))","v":false},{"$f":"IF(I14=$AB$9,$AB$10,IF(I14=$AC$9,$AC$10,IF(I14=$AD$9,$AD$10,IF(I14=$AE$9,$AE$10))))","v":false},{"$f":"IF(J14=$AB$9,$AB$10,IF(J14=$AC$9,$AC$10,IF(J14=$AD$9,$AD$10,IF(J14=$AE$9,$AE$10))))","v":false},{"$f":"SUM(AG14:AJ14)","v":0},{"$f":"IF(K14=$AB$9,$AB$10,IF(K14=$AC$9,$AC$10,IF(K14=$AD$9,$AD$10,IF(K14=$AE$9,$AE$10))))","v":false},{"$f":"IF(L14=$AB$9,$AB$10,IF(L14=$AC$9,$AC$10,IF(L14=$AD$9,$AD$10,IF(L14=$AE$9,$AE$10))))","v":false},{"$f":"IF(M14=$AB$9,$AB$10,IF(M14=$AC$9,$AC$10,IF(M14=$AD$9,$AD$10,IF(M14=$AE$9,$AE$10))))","v":false},{"$f":"IF(N14=$AB$9,$AB$10,IF(N14=$AC$9,$AC$10,IF(N14=$AD$9,$AD$10,IF(N14=$AE$9,$AE$10))))","v":false},{"$f":"SUM(AL14:AO14)","v":0},{"$f":"IF(O14=$AB$9,$AB$10,IF(O14=$AC$9,$AC$10,IF(O14=$AD$9,$AD$10,IF(O14=$AE$9,$AE$10))))","v":false},{"$f":"IF(P14=$AB$9,$AB$10,IF(P14=$AC$9,$AC$10,IF(P14=$AD$9,$AD$10,IF(P14=$AE$9,$AE$10))))","v":false},{"$f":"IF(Q14=$AB$9,$AB$10,IF(Q14=$AC$9,$AC$10,IF(Q14=$AD$9,$AD$10,IF(Q14=$AE$9,$AE$10))))","v":false},{"$f":"IF(R14=$AB$9,$AB$10,IF(R14=$AC$9,$AC$10,IF(R14=$AD$9,$AD$10,IF(R14=$AE$9,$AE$10))))","v":false},{"$f":"SUM(AQ14:AT14)","v":0},{"$f":"MAX(AF14,AK14,AP14,AU14)","v":0}]
[2,{"$f":"CONCATENATE(FILIACION_ESTUDIANTE!B9,\"  \",FILIACION_ESTUDIANTE!C9,\"  \",FILIACION_ESTUDIANTE!D9)","v":"    "}]
[3,{"$f":"CONCATENATE(FILIACION_ESTUDIANTE!B10,\"  \",FILIACION_ESTUDIANTE!C10,\"  \",FILIACION_ESTUDIANTE!D10)","v":"    "}]
[4,{"$f":"CONCATENATE(FILIACION_ESTUDIANTE!B11,\"  \",FILIACION_ESTUDIANTE!C11,\"  \",FILIACION_ESTUDIANTE!D11)","v":"    "}]
[5,{"$f":"CONCATENATE(FILIACION_ESTUDIANTE!B12,\"  \",FILIACION_ESTUDIANTE!C12,\"  \",FILIACION_ESTUDIANTE!D12)","v":"    "}]
[6,{"$f":"CONCATENATE(FILIACION_ESTUDIANTE!B13,\"  \",FILIACION_ESTUDIANTE!C13,\"  \",FILIACION_ESTUDIANTE!D13)","v":"    "}]
[7,{"$f":"CONCATENATE(FILIACION_ESTUDIANTE!B14,\"  \",FILIACION_ESTUDIANTE!C14,\"  \",FILIACION_ESTUDIANTE!D14)","v":"    "}]
[8,{"$f":"CONCATENATE(FILIACION_ESTUDIANTE!B15,\"  \",FILIACION_ESTUDIANTE!C15,\"  \",FILIACION_ESTUDIANTE!D15)","v":"    "}]
[9,{"$f":"CONCATENATE(FILIACION_ESTUDIANTE!B16,\"  \",FILIACION_ESTUDIANTE!C16,\"  \",FILIACION_ESTUDIANTE!D16)","v":"    "}]
[10,{"$f":"CONCATENATE(FILIACION_ESTUDIANTE!B17,\"  \",FILIACION_ESTUDIANTE!C17,\"  \",FILIACION_ESTUDIANTE!D17)","v":"    "}]
[11,{"$f":"CONCATENATE(FILIACION_ESTUDIANTE!B18,\"  \",FILIACION_ESTUDIANTE!C18,\"  \",FILIACION_ESTUDIANTE!D18)","v":"    "}]
[12,{"$f":"CONCATENATE(FILIACION_ESTUDIANTE!B19,\"  \",FILIACION_ESTUDIANTE!C19,\"  \",FILIACION_ESTUDIANTE!D19)","v":"    "}]
[13,{"$f":"CONCATENATE(FILIACION_ESTUDIANTE!B20,\"  \",FILIACION_ESTUDIANTE!C20,\"  \",FILIACION_ESTUDIANTE!D20)","v":"    "}]
[14,{"$f":"CONCATENATE(FILIACION_ESTUDIANTE!B21,\"  \",FILIACION_ESTUDIANTE!C21,\"  \",FILIACION_ESTUDIANTE!D21)","v":"    "}]
[15,{"$f":"CONCATENATE(FILIACION_ESTUDIANTE!B22,\"  \",FILIACION_ESTUDIANTE!C22,\"  \",FILIACION_ESTUDIANTE!D22)","v":"    "}]
[16,{"$f":"CONCATENATE(FILIACION_ESTUDIANTE!B23,\"  \",FILIACION_ESTUDIANTE!C23,\"  \",FILIACION_ESTUDIANTE!D23)","v":"    "}]
[17,{"$f":"CONCATENATE(FILIACION_ESTUDIANTE!B24,\"  \",FILIACION_ESTUDIANTE!C24,\"  \",FILIACION_ESTUDIANTE!D24)","v":"    "}]
[18,{"$f":"CONCATENATE(FILIACION_ESTUDIANTE!B25,\"  \",FILIACION_ESTUDIANTE!C25,\"  \",FILIACION_ESTUDIANTE!D25)","v":"    "}]
[19,{"$f":"CONCATENATE(FILIACION_ESTUDIANTE!B26,\"  \",FILIACION_ESTUDIANTE!C26,\"  \",FILIACION_ESTUDIANTE!D26)","v":"    "}]
[20,{"$f":"CONCATENATE(FILIACION_ESTUDIANTE!B27,\"  \",FILIACION_ESTUDIANTE!C27,\"  \",FILIACION_ESTUDIANTE!D27)","v":"    "}]
[21,{"$f":"CONCATENATE(FILIACION_ESTUDIANTE!B28,\"  \",FILIACION_ESTUDIANTE!C28,\"  \",FILIACION_ESTUDIANTE!D28)","v":"    "}]
[22,{"$f":"CONCATENATE(FILIACION_ESTUDIANTE!B29,\"  \",FILIACION_ESTUDIANTE!C29,\"  \",FILIACION_ESTUDIANTE!D29)","v":"    "}]
[23,{"$f":"CONCATENATE(FILIACION_ESTUDIANTE!B30,\"  \",FILIACION_ESTUDIANTE!C30,\"  \",FILIACION_ESTUDIANTE!D30)","v":"    "}]
[24,{"$f":"CONCATENATE(FILIACION_ESTUDIANTE!B31,\"  \",FILIACION_ESTUDIANTE!C31,\"  \",FILIACION_ESTUDIANTE!D31)","v":"    "}]
[25,{"$f":"CONCATENATE(FILIACION_ESTUDIANTE!B32,\"  \",FILIACION_ESTUDIANTE!C32,\"  \",FILIACION_ESTUDIANTE!D32)","v":"    "}]
[26,{"$f":"CONCATENATE(FILIACION_ESTUDIANTE!B33,\"  \",FILIACION_ESTUDIANTE!C33,\"  \",FILIACION_ESTUDIANTE!D33)","v":"    "}]
[27,{"$f":"CONCATENATE(FILIACION_ESTUDIANTE!B34,\"  \",FILIACION_ESTUDIANTE!C34,\"  \",FILIACION_ESTUDIANTE!D34)","v":"    "}]
[28,{"$f":"CONCATENATE(FILIACION_ESTUDIANTE!B35,\"  \",FILIACION_ESTUDIANTE!C35,\"  \",FILIACION_ESTUDIANTE!D35)","v":"    "}]
[29,{"$f":"CONCATENATE(FILIACION_ESTUDIANTE!B36,\"  \",FILIACION_ESTUDIANTE!C36,\"  \",FILIACION_ESTUDIANTE!D36)","v":"    "}]
[30,{"$f":"CONCATENATE(FILIACION_ESTUDIANTE!B37,\"  \",FILIACION_ESTUDIANTE!C37,\"  \",FILIACION_ESTUDIANTE!D37)","v":"    "}]
[31,{"$f":"CONCATENATE(FILIACION_ESTUDIANTE!B38,\"  \",FILIACION_ESTUDIANTE!C38,\"  \",FILIACION_ESTUDIANTE!D38)","v":"    "}]
[32,{"$f":"CONCATENATE(FILIACION_ESTUDIANTE!B39,\"  \",FILIACION_ESTUDIANTE!C39,\"  \",FILIACION_ESTUDIANTE!D39)","v":"    "}]
[33,{"$f":"CONCATENATE(FILIACION_ESTUDIANTE!B40,\"  \",FILIACION_ESTUDIANTE!C40,\"  \",FILIACION_ESTUDIANTE!D40)","v":"    "}]
[34,{"$f":"CONCATENATE(FILIACION_ESTUDIANTE!B41,\"  \",FILIACION_ESTUDIANTE!C41,\"  \",FILIACION_ESTUDIANTE!D41)","v":"    "}]
[35,{"$f":"CONCATENATE(FILIACION_ESTUDIANTE!B42,\"  \",FILIACION_ESTUDIANTE!C42,\"  \",FILIACION_ESTUDIANTE!D42)","v":"    "}]
[36,{"$f":"CONCATENATE(FILIACION_ESTUDIANTE!B43,\"  \",FILIACION_ESTUDIANTE!C43,\"  \",FILIACION_ESTUDIANTE!D43)","v":"    "}]
[37,{"$f":"CONCATENATE(FILIACION_ESTUDIANTE!B44,\"  \",FILIACION_ESTUDIANTE!C44,\"  \",FILIACION_ESTUDIANTE!D44)","v":"    "}]
[38,{"$f":"CONCATENATE(FILIACION_ESTUDIANTE!B45,\"  \",FILIACION_ESTUDIANTE!C45,\"  \",FILIACION_ESTUDIANTE!D45)","v":"    "}]
[39,{"$f":"CONCATENATE(FILIACION_ESTUDIANTE!B46,\"  \",FILIACION_ESTUDIANTE!C46,\"  \",FILIACION_ESTUDIANTE!D46)","v":"    "}]
[40,{"$f":"CONCATENATE(FILIACION_ESTUDIANTE!B47,\"  \",FILIACION_ESTUDIANTE!C47,\"  \",FILIACION_ESTUDIANTE!D47)","v":"    "}]

{"sheet":"VIDA_TIERRA_3B","index":35,"n_rows":53,"n_cols":48,"rows_kept":53,"cut":false,"hidden":false,"merged":[[11,14,12,14],[11,7,12,7],[11,8,12,8],[11,9,12,9],[11,10,12,10],[11,11,12,11],[11,2,12,2],[11,3,12,3],[11,4,12,4],[11,5,12,5],[11,6,12,6],[33,18,33,19],[34,18,34,19],[35,18,35,19],[36,18,36,19],[37,18,37,19],[38,18,38,19],[39,18,39,19],[40,18,40,19],[41,18,41,19],[42,18,42,19],[51,18,51,19],[52,18,52,19],[43,18,43,19],[44,18,44,19],[45,18,45,19],[46,18,46,19],[47,18,47,19],[48,18,48,19],[49,18,49,19],[50,18,50,19],[29,18,29,19],[30,18,30,19],[31,18,31,19],[32,18,32,19],[23,18,23,19],[24,18,24,19],[25,18,25,19],[26,18,26,19],[27,18,27,19],[28,18,28,19],[18,18,18,19],[19,18,19,19],[20,18,20,19],[21,18,21,19],[22,18,22,19],[13,18,13,19],[14,18,14,19],[15,18,15,19],[16,18,16,19],[17,18,17,19],[1,1,2,1],[1,2,1,19],[1,27,6,31],[2,2,2,19],[3,0,3,1],[3,2,3,11],[3,12,3,17],[3,18,3,20],[4,0,4,20],[5,0,5,1],[6,0,12,0],[6,2,6,5],[6,6,6,9],[6,10,6,13],[6,14,6,17],[5,2,5,20],[7,6,9,6],[7,7,9,7],[7,8,9,8],[7,9,9,9],[7,10,9,10],[7,1,9,1],[7,2,9,2],[7,3,9,3],[7,4,9,4],[7,5,9,5],[6,18,8,19],[7,11,9,11],[7,12,9,12],[7,14,9,14],[6,20,12,20],[7,13,9,13],[7,15,9,15],[7,16,9,16],[7,17,9,17],[11,15,12,15],[11,16,12,16],[11,17,12,17],[11,18,12,19],[10,18,10,19],[11,12,12,12],[11,13,12,13]]}
[]
[null,null,"CUADRO DE VALORACIÓN",null,null,null,null,null,null,null,null,null,null,null,null,null,null,null,null,null,null,null,null,null,null,null,null,"REGISTRO DE VALORACION",null,null,null,null,"ED",null,null,null,null,null,null,null,"DA","DO",null,"DP"]
[null,null,"EDUCACIÓN INICIAL  EN FAMILIA COMUNITARIA ",null,null,null,null,null,null,null,null,null,null,null,null,null,null,null,null,null,"3er BIMESTRE"]
[{"$f":"UPPER( CARATULA!$C$20)","v":"MAESTRA (O):"},null,{"$f":"CARATULA!$E$20","v":0},null,null,null,null,null,null,null,null,null,{"$f":"UPPER(CARATULA!$C$21)","v":"AÑO DE ESCOLARIDAD:"},null,null,null,null,null,{"$f":"CARATULA!$E$21","v":0}]
["CAMPO DE SABER Y CONOCIMIENTO -  VIDA TIERRA Y TERRITORIO"]
["EVALUACIÓN",null,"CRITERIOS DE LAS DIMENSIONES"]
["Nº","DIMENSIONES","SER",null,null,null,"SABER",null,null,null,"HACER",null,null,null,"DECIDIR",null,null,null,"AUTOEVALUACIÓN (SER, SABER, HACER, DECIDIR)",null,"SÍNTESIS CUALITATIVA DEL BIMESTRE"]
[null,"PLANES DE CLASE (PDC)","PDC","PDC","PDC","PDC","PDC","PDC","PDC","PDC","PDC","PDC","PDC","PDC","PDC","PDC","PDC","PDC"]
[null,null,null,null,null,null,null,null,null,null,null,null,null,null,null,null,null,null,null,null,null,null,null,null,null,null,null,"DP","DO","DA","ED"]
[null,null,null,null,null,null,null,null,null,null,null,null,null,null,null,null,null,null,null,null,null,null,null,null,null,null,null,14,8,5,1]
[null,"CRITERIOS DE EVALUACIÓN","F"]
[null,"INSTRUMENTOS Y/O ESTRATEGIAS DE EVALUACIÓN"]
[null,"APELLIDOS Y NOMBRES"]
[1,{"$f":"CONCATENATE(FILIACION_ESTUDIANTE!B8,\"  \",FILIACION_ESTUDIANTE!C8,\"  \",FILIACION_ESTUDIANTE!D8)","v":"    "},null,null,null,null,null,null,null,null,null,null,null,null,null,null,null,null,null,null,null,null,null,"demuestra  algunas actitudes armonicas etre sfamilia Y  LE FALTAT",null,null,null,{"$f":"IF(C14=$AB$9,$AB$10,IF(C14=$AC$9,$AC$10,IF(C14=$AD$9,$AD$10,IF(C14=$AE$9,$AE$10))))","v":false},{"$f":"IF(D14=$AB$9,$AB$10,IF(D14=$AC$9,$AC$10,IF(D14=$AD$9,$AD$10,IF(D14=$AE$9,$AE$10))))","v":false},{"$f":"IF(E14=$AB$9,$AB$10,IF(E14=$AC$9,$AC$10,IF(E14=$AD$9,$AD$10,IF(E14=$AE$9,$AE$10))))","v":false},{"$f":"IF(F14=$AB$9,$AB$10,IF(F14=$AC$9,$AC$10,IF(F14=$AD$9,$AD$10,IF(F14=$AE$9,$AE$10))))","v":false},{"$f":"SUM(AB14:AE14)","v":0},{"$f":"IF(G14=$AB$9,$AB$10,IF(G14=$AC$9,$AC$10,IF(G14=$AD$9,$AD$10,IF(G14=$AE$9,$AE$10))))","v":false},{"$f":"IF(H14=$AB$9,$AB$10,IF(H14=$AC$9,$AC$10,IF(H14=$AD$9,$AD$10,IF(H14=$AE$9,$AE$10))))","v":false},{"$f":"IF(I14=$AB$9,$AB$10,IF(I14=$AC$9,$AC$10,IF(I14=$AD$9,$AD$10,IF(I14=$AE$9,$AE$10))))","v":false},{"$f":"IF(J14=$AB$9,$AB$10,IF(J14=$AC$9,$AC$10,IF(J14=$AD$9,$AD$10,IF(J14=$AE$9,$AE$10))))","v":false},{"$f":"SUM(AG14:AJ14)","v":0},{"$f":"IF(K14=$AB$9,$AB$10,IF(K14=$AC$9,$AC$10,IF(K14=$AD$9,$AD$10,IF(K14=$AE$9,$AE$10))))","v":false},{"$f":"IF(L14=$AB$9,$AB$10,IF(L14=$AC$9,$AC$10,IF(L14=$AD$9,$AD$10,IF(L14=$AE$9,$AE$10))))","v":false},{"$f":"IF(M14=$AB$9,$AB$10,IF(M14=$AC$9,$AC$10,IF(M14=$AD$9,$AD$10,IF(M14=$AE$9,$AE$10))))","v":false},{"$f":"IF(N14=$AB$9,$AB$10,IF(N14=$AC$9,$AC$10,IF(N14=$AD$9,$AD$10,IF(N14=$AE$9,$AE$10))))","v":false},{"$f":"SUM(AL14:AO14)","v":0},{"$f":"IF(O14=$AB$9,$AB$10,IF(O14=$AC$9,$AC$10,IF(O14=$AD$9,$AD$10,IF(O14=$AE$9,$AE$10))))","v":false},{"$f":"IF(P14=$AB$9,$AB$10,IF(P14=$AC$9,$AC$10,IF(P14=$AD$9,$AD$10,IF(P14=$AE$9,$AE$10))))","v":false},{"$f":"IF(Q14=$AB$9,$AB$10,IF(Q14=$AC$9,$AC$10,IF(Q14=$AD$9,$AD$10,IF(Q14=$AE$9,$AE$10))))","v":false},{"$f":"IF(R14=$AB$9,$AB$10,IF(R14=$AC$9,$AC$10,IF(R14=$AD$9,$AD$10,IF(R14=$AE$9,$AE$10))))","v":false},{"$f":"SUM(AQ14:AT14)","v":0},{"$f":"MAX(AF14,AK14,AP14,AU14)","v":0}]
[2,{"$f":"CONCATENATE(FILIACION_ESTUDIANTE!B9,\"  \",FILIACION_ESTUDIANTE!C9,\"  \",FILIACION_ESTUDIANTE!D9)","v":"    "}]
[3,{"$f":"CONCATENATE(FILIACION_ESTUDIANTE!B10,\"  \",FILIACION_ESTUDIANTE!C10,\"  \",FILIACION_ESTUDIANTE!D10)","v":"    "}]
[4,{"$f":"CONCATENATE(FILIACION_ESTUDIANTE!B11,\"  \",FILIACION_ESTUDIANTE!C11,\"  \",FILIACION_ESTUDIANTE!D11)","v":"    "}]
[5,{"$f":"CONCATENATE(FILIACION_ESTUDIANTE!B12,\"  \",FILIACION_ESTUDIANTE!C12,\"  \",FILIACION_ESTUDIANTE!D12)","v":"    "}]
[6,{"$f":"CONCATENATE(FILIACION_ESTUDIANTE!B13,\"  \",FILIACION_ESTUDIANTE!C13,\"  \",FILIACION_ESTUDIANTE!D13)","v":"    "}]
[7,{"$f":"CONCATENATE(FILIACION_ESTUDIANTE!B14,\"  \",FILIACION_ESTUDIANTE!C14,\"  \",FILIACION_ESTUDIANTE!D14)","v":"    "}]
[8,{"$f":"CONCATENATE(FILIACION_ESTUDIANTE!B15,\"  \",FILIACION_ESTUDIANTE!C15,\"  \",FILIACION_ESTUDIANTE!D15)","v":"    "}]
[9,{"$f":"CONCATENATE(FILIACION_ESTUDIANTE!B16,\"  \",FILIACION_ESTUDIANTE!C16,\"  \",FILIACION_ESTUDIANTE!D16)","v":"    "}]
[10,{"$f":"CONCATENATE(FILIACION_ESTUDIANTE!B17,\"  \",FILIACION_ESTUDIANTE!C17,\"  \",FILIACION_ESTUDIANTE!D17)","v":"    "}]
[11,{"$f":"CONCATENATE(FILIACION_ESTUDIANTE!B18,\"  \",FILIACION_ESTUDIANTE!C18,\"  \",FILIACION_ESTUDIANTE!D18)","v":"    "}]
[12,{"$f":"CONCATENATE(FILIACION_ESTUDIANTE!B19,\"  \",FILIACION_ESTUDIANTE!C19,\"  \",FILIACION_ESTUDIANTE!D19)","v":"    "}]
[13,{"$f":"CONCATENATE(FILIACION_ESTUDIANTE!B20,\"  \",FILIACION_ESTUDIANTE!C20,\"  \",FILIACION_ESTUDIANTE!D20)","v":"    "}]
[14,{"$f":"CONCATENATE(FILIACION_ESTUDIANTE!B21,\"  \",FILIACION_ESTUDIANTE!C21,\"  \",FILIACION_ESTUDIANTE!D21)","v":"    "}]
[15,{"$f":"CONCATENATE(FILIACION_ESTUDIANTE!B22,\"  \",FILIACION_ESTUDIANTE!C22,\"  \",FILIACION_ESTUDIANTE!D22)","v":"    "}]
[16,{"$f":"CONCATENATE(FILIACION_ESTUDIANTE!B23,\"  \",FILIACION_ESTUDIANTE!C23,\"  \",FILIACION_ESTUDIANTE!D23)","v":"    "}]
[17,{"$f":"CONCATENATE(FILIACION_ESTUDIANTE!B24,\"  \",FILIACION_ESTUDIANTE!C24,\"  \",FILIACION_ESTUDIANTE!D24)","v":"    "}]
[18,{"$f":"CONCATENATE(FILIACION_ESTUDIANTE!B25,\"  \",FILIACION_ESTUDIANTE!C25,\"  \",FILIACION_ESTUDIANTE!D25)","v":"    "}]
[19,{"$f":"CONCATENATE(FILIACION_ESTUDIANTE!B26,\"  \",FILIACION_ESTUDIANTE!C26,\"  \",FILIACION_ESTUDIANTE!D26)","v":"    "}]
[20,{"$f":"CONCATENATE(FILIACION_ESTUDIANTE!B27,\"  \",FILIACION_ESTUDIANTE!C27,\"  \",FILIACION_ESTUDIANTE!D27)","v":"    "}]
[21,{"$f":"CONCATENATE(FILIACION_ESTUDIANTE!B28,\"  \",FILIACION_ESTUDIANTE!C28,\"  \",FILIACION_ESTUDIANTE!D28)","v":"    "}]
[22,{"$f":"CONCATENATE(FILIACION_ESTUDIANTE!B29,\"  \",FILIACION_ESTUDIANTE!C29,\"  \",FILIACION_ESTUDIANTE!D29)","v":"    "}]
[23,{"$f":"CONCATENATE(FILIACION_ESTUDIANTE!B30,\"  \",FILIACION_ESTUDIANTE!C30,\"  \",FILIACION_ESTUDIANTE!D30)","v":"    "}]
[24,{"$f":"CONCATENATE(FILIACION_ESTUDIANTE!B31,\"  \",FILIACION_ESTUDIANTE!C31,\"  \",FILIACION_ESTUDIANTE!D31)","v":"    "}]
[25,{"$f":"CONCATENATE(FILIACION_ESTUDIANTE!B32,\"  \",FILIACION_ESTUDIANTE!C32,\"  \",FILIACION_ESTUDIANTE!D32)","v":"    "}]
[26,{"$f":"CONCATENATE(FILIACION_ESTUDIANTE!B33,\"  \",FILIACION_ESTUDIANTE!C33,\"  \",FILIACION_ESTUDIANTE!D33)","v":"    "}]
[27,{"$f":"CONCATENATE(FILIACION_ESTUDIANTE!B34,\"  \",FILIACION_ESTUDIANTE!C34,\"  \",FILIACION_ESTUDIANTE!D34)","v":"    "}]
[28,{"$f":"CONCATENATE(FILIACION_ESTUDIANTE!B35,\"  \",FILIACION_ESTUDIANTE!C35,\"  \",FILIACION_ESTUDIANTE!D35)","v":"    "}]
[29,{"$f":"CONCATENATE(FILIACION_ESTUDIANTE!B36,\"  \",FILIACION_ESTUDIANTE!C36,\"  \",FILIACION_ESTUDIANTE!D36)","v":"    "}]
[30,{"$f":"CONCATENATE(FILIACION_ESTUDIANTE!B37,\"  \",FILIACION_ESTUDIANTE!C37,\"  \",FILIACION_ESTUDIANTE!D37)","v":"    "}]
[31,{"$f":"CONCATENATE(FILIACION_ESTUDIANTE!B38,\"  \",FILIACION_ESTUDIANTE!C38,\"  \",FILIACION_ESTUDIANTE!D38)","v":"    "}]
[32,{"$f":"CONCATENATE(FILIACION_ESTUDIANTE!B39,\"  \",FILIACION_ESTUDIANTE!C39,\"  \",FILIACION_ESTUDIANTE!D39)","v":"    "}]
[33,{"$f":"CONCATENATE(FILIACION_ESTUDIANTE!B40,\"  \",FILIACION_ESTUDIANTE!C40,\"  \",FILIACION_ESTUDIANTE!D40)","v":"    "}]
[34,{"$f":"CONCATENATE(FILIACION_ESTUDIANTE!B41,\"  \",FILIACION_ESTUDIANTE!C41,\"  \",FILIACION_ESTUDIANTE!D41)","v":"    "}]
[35,{"$f":"CONCATENATE(FILIACION_ESTUDIANTE!B42,\"  \",FILIACION_ESTUDIANTE!C42,\"  \",FILIACION_ESTUDIANTE!D42)","v":"    "}]
[36,{"$f":"CONCATENATE(FILIACION_ESTUDIANTE!B43,\"  \",FILIACION_ESTUDIANTE!C43,\"  \",FILIACION_ESTUDIANTE!D43)","v":"    "}]
[37,{"$f":"CONCATENATE(FILIACION_ESTUDIANTE!B44,\"  \",FILIACION_ESTUDIANTE!C44,\"  \",FILIACION_ESTUDIANTE!D44)","v":"    "}]
[38,{"$f":"CONCATENATE(FILIACION_ESTUDIANTE!B45,\"  \",FILIACION_ESTUDIANTE!C45,\"  \",FILIACION_ESTUDIANTE!D45)","v":"    "}]
[39,{"$f":"CONCATENATE(FILIACION_ESTUDIANTE!B46,\"  \",FILIACION_ESTUDIANTE!C46,\"  \",FILIACION_ESTUDIANTE!D46)","v":"    "}]
[40,{"$f":"CONCATENATE(FILIACION_ESTUDIANTE!B47,\"  \",FILIACION_ESTUDIANTE!C47,\"  \",FILIACION_ESTUDIANTE!D47)","v":"    "}]

{"sheet":"VIDA_TIERRA_4B","index":36,"n_rows":53,"n_cols":48,"rows_kept":53,"cut":false,"hidden":false,"merged":[[11,14,12,14],[11,7,12,7],[11,8,12,8],[11,9,12,9],[11,10,12,10],[11,11,12,11],[11,2,12,2],[11,3,12,3],[11,4,12,4],[11,5,12,5],[11,6,12,6],[33,18,33,19],[34,18,34,19],[35,18,35,19],[36,18,36,19],[37,18,37,19],[38,18,38,19],[39,18,39,19],[40,18,40,19],[41,18,41,19],[42,18,42,19],[51,18,51,19],[52,18,52,19],[43,18,43,19],[44,18,44,19],[45,18,45,19],[46,18,46,19],[47,18,47,19],[48,18,48,19],[49,18,49,19],[50,18,50,19],[29,18,29,19],[30,18,30,19],[31,18,31,19],[32,18,32,19],[23,18,23,19],[24,18,24,19],[25,18,25,19],[26,18,26,19],[27,18,27,19],[28,18,28,19],[18,18,18,19],[19,18,19,19],[20,18,20,19],[21,18,21,19],[22,18,22,19],[13,18,13,19],[14,18,14,19],[15,18,15,19],[16,18,16,19],[17,18,17,19],[1,1,2,1],[1,2,1,19],[1,27,6,31],[2,2,2,19],[3,0,3,1],[3,2,3,11],[3,12,3,17],[3,18,3,20],[4,0,4,20],[5,0,5,1],[6,0,12,0],[6,2,6,5],[6,6,6,9],[6,10,6,13],[6,14,6,17],[5,2,5,20],[7,6,9,6],[7,7,9,7],[7,8,9,8],[7,9,9,9],[7,10,9,10],[7,1,9,1],[7,2,9,2],[7,3,9,3],[7,4,9,4],[7,5,9,5],[6,18,8,19],[7,11,9,11],[7,12,9,12],[7,14,9,14],[6,20,12,20],[7,13,9,13],[7,15,9,15],[7,16,9,16],[7,17,9,17],[11,15,12,15],[11,16,12,16],[11,17,12,17],[11,18,12,19],[10,18,10,19],[11,12,12,12],[11,13,12,13]]}
[]
[null,null,"CUADRO DE VALORACIÓN",null,null,null,null,null,null,null,null,null,null,null,null,null,null,null,null,null,null,null,null,null,null,null,null,"REGISTRO DE VALORACION",null,null,null,null,"ED",null,null,null,null,null,null,null,"DA","DO",null,"DP"]
[null,null,"EDUCACIÓN INICIAL  EN FAMILIA COMUNITARIA ",null,null,null,null,null,null,null,null,null,null,null,null,null,null,null,null,null,"4° BIMESTRE"]
[{"$f":"UPPER( CARATULA!$C$20)","v":"MAESTRA (O):"},null,{"$f":"CARATULA!$E$20","v":0},null,null,null,null,null,null,null,null,null,{"$f":"UPPER(CARATULA!$C$21)","v":"AÑO DE ESCOLARIDAD:"},null,null,null,null,null,{"$f":"CARATULA!$E$21","v":0}]
["CAMPO DE SABER Y CONOCIMIENTO -  VIDA TIERRA Y TERRITORIO"]
["EVALUACIÓN",null,"CRITERIOS DE LAS DIMENSIONES"]
["Nº","DIMENSIONES","SER",null,null,null,"SABER",null,null,null,"HACER",null,null,null,"DECIDIR",null,null,null,"AUTOEVALUACIÓN (SER, SABER, HACER, DECIDIR)",null,"SÍNTESIS CUALITATIVA DEL BIMESTRE"]
[null,"PLANES DE CLASE (PDC)","PDC","PDC","PDC","PDC","PDC","PDC","PDC","PDC","PDC","PDC","PDC","PDC","PDC","PDC","PDC","PDC"]
[null,null,null,null,null,null,null,null,null,null,null,null,null,null,null,null,null,null,null,null,null,null,null,null,null,null,null,"DP","DO","DA","ED"]
[null,null,null,null,null,null,null,null,null,null,null,null,null,null,null,null,null,null,null,null,null,null,null,null,null,null,null,14,8,5,1]
[null,"CRITERIOS DE EVALUACIÓN"]
[null,"INSTRUMENTOS Y/O ESTRATEGIAS DE EVALUACIÓN"]
[null,"APELLIDOS Y NOMBRES"]
[1,{"$f":"CONCATENATE(FILIACION_ESTUDIANTE!B8,\"  \",FILIACION_ESTUDIANTE!C8,\"  \",FILIACION_ESTUDIANTE!D8)","v":"    "},null,null,null,null,null,null,null,null,null,null,null,null,null,null,null,null,null,null,null,null,null,"demuestra  algunas actitudes armonicas etre sfamilia Y  LE FALTAT",null,null,null,{"$f":"IF(C14=$AB$9,$AB$10,IF(C14=$AC$9,$AC$10,IF(C14=$AD$9,$AD$10,IF(C14=$AE$9,$AE$10))))","v":false},{"$f":"IF(D14=$AB$9,$AB$10,IF(D14=$AC$9,$AC$10,IF(D14=$AD$9,$AD$10,IF(D14=$AE$9,$AE$10))))","v":false},{"$f":"IF(E14=$AB$9,$AB$10,IF(E14=$AC$9,$AC$10,IF(E14=$AD$9,$AD$10,IF(E14=$AE$9,$AE$10))))","v":false},{"$f":"IF(F14=$AB$9,$AB$10,IF(F14=$AC$9,$AC$10,IF(F14=$AD$9,$AD$10,IF(F14=$AE$9,$AE$10))))","v":false},{"$f":"SUM(AB14:AE14)","v":0},{"$f":"IF(G14=$AB$9,$AB$10,IF(G14=$AC$9,$AC$10,IF(G14=$AD$9,$AD$10,IF(G14=$AE$9,$AE$10))))","v":false},{"$f":"IF(H14=$AB$9,$AB$10,IF(H14=$AC$9,$AC$10,IF(H14=$AD$9,$AD$10,IF(H14=$AE$9,$AE$10))))","v":false},{"$f":"IF(I14=$AB$9,$AB$10,IF(I14=$AC$9,$AC$10,IF(I14=$AD$9,$AD$10,IF(I14=$AE$9,$AE$10))))","v":false},{"$f":"IF(J14=$AB$9,$AB$10,IF(J14=$AC$9,$AC$10,IF(J14=$AD$9,$AD$10,IF(J14=$AE$9,$AE$10))))","v":false},{"$f":"SUM(AG14:AJ14)","v":0},{"$f":"IF(K14=$AB$9,$AB$10,IF(K14=$AC$9,$AC$10,IF(K14=$AD$9,$AD$10,IF(K14=$AE$9,$AE$10))))","v":false},{"$f":"IF(L14=$AB$9,$AB$10,IF(L14=$AC$9,$AC$10,IF(L14=$AD$9,$AD$10,IF(L14=$AE$9,$AE$10))))","v":false},{"$f":"IF(M14=$AB$9,$AB$10,IF(M14=$AC$9,$AC$10,IF(M14=$AD$9,$AD$10,IF(M14=$AE$9,$AE$10))))","v":false},{"$f":"IF(N14=$AB$9,$AB$10,IF(N14=$AC$9,$AC$10,IF(N14=$AD$9,$AD$10,IF(N14=$AE$9,$AE$10))))","v":false},{"$f":"SUM(AL14:AO14)","v":0},{"$f":"IF(O14=$AB$9,$AB$10,IF(O14=$AC$9,$AC$10,IF(O14=$AD$9,$AD$10,IF(O14=$AE$9,$AE$10))))","v":false},{"$f":"IF(P14=$AB$9,$AB$10,IF(P14=$AC$9,$AC$10,IF(P14=$AD$9,$AD$10,IF(P14=$AE$9,$AE$10))))","v":false},{"$f":"IF(Q14=$AB$9,$AB$10,IF(Q14=$AC$9,$AC$10,IF(Q14=$AD$9,$AD$10,IF(Q14=$AE$9,$AE$10))))","v":false},{"$f":"IF(R14=$AB$9,$AB$10,IF(R14=$AC$9,$AC$10,IF(R14=$AD$9,$AD$10,IF(R14=$AE$9,$AE$10))))","v":false},{"$f":"SUM(AQ14:AT14)","v":0},{"$f":"MAX(AF14,AK14,AP14,AU14)","v":0}]
[2,{"$f":"CONCATENATE(FILIACION_ESTUDIANTE!B9,\"  \",FILIACION_ESTUDIANTE!C9,\"  \",FILIACION_ESTUDIANTE!D9)","v":"    "}]
[3,{"$f":"CONCATENATE(FILIACION_ESTUDIANTE!B10,\"  \",FILIACION_ESTUDIANTE!C10,\"  \",FILIACION_ESTUDIANTE!D10)","v":"    "}]
[4,{"$f":"CONCATENATE(FILIACION_ESTUDIANTE!B11,\"  \",FILIACION_ESTUDIANTE!C11,\"  \",FILIACION_ESTUDIANTE!D11)","v":"    "}]
[5,{"$f":"CONCATENATE(FILIACION_ESTUDIANTE!B12,\"  \",FILIACION_ESTUDIANTE!C12,\"  \",FILIACION_ESTUDIANTE!D12)","v":"    "}]
[6,{"$f":"CONCATENATE(FILIACION_ESTUDIANTE!B13,\"  \",FILIACION_ESTUDIANTE!C13,\"  \",FILIACION_ESTUDIANTE!D13)","v":"    "}]
[7,{"$f":"CONCATENATE(FILIACION_ESTUDIANTE!B14,\"  \",FILIACION_ESTUDIANTE!C14,\"  \",FILIACION_ESTUDIANTE!D14)","v":"    "}]
[8,{"$f":"CONCATENATE(FILIACION_ESTUDIANTE!B15,\"  \",FILIACION_ESTUDIANTE!C15,\"  \",FILIACION_ESTUDIANTE!D15)","v":"    "}]
[9,{"$f":"CONCATENATE(FILIACION_ESTUDIANTE!B16,\"  \",FILIACION_ESTUDIANTE!C16,\"  \",FILIACION_ESTUDIANTE!D16)","v":"    "}]
[10,{"$f":"CONCATENATE(FILIACION_ESTUDIANTE!B17,\"  \",FILIACION_ESTUDIANTE!C17,\"  \",FILIACION_ESTUDIANTE!D17)","v":"    "}]
[11,{"$f":"CONCATENATE(FILIACION_ESTUDIANTE!B18,\"  \",FILIACION_ESTUDIANTE!C18,\"  \",FILIACION_ESTUDIANTE!D18)","v":"    "}]
[12,{"$f":"CONCATENATE(FILIACION_ESTUDIANTE!B19,\"  \",FILIACION_ESTUDIANTE!C19,\"  \",FILIACION_ESTUDIANTE!D19)","v":"    "}]
[13,{"$f":"CONCATENATE(FILIACION_ESTUDIANTE!B20,\"  \",FILIACION_ESTUDIANTE!C20,\"  \",FILIACION_ESTUDIANTE!D20)","v":"    "}]
[14,{"$f":"CONCATENATE(FILIACION_ESTUDIANTE!B21,\"  \",FILIACION_ESTUDIANTE!C21,\"  \",FILIACION_ESTUDIANTE!D21)","v":"    "}]
[15,{"$f":"CONCATENATE(FILIACION_ESTUDIANTE!B22,\"  \",FILIACION_ESTUDIANTE!C22,\"  \",FILIACION_ESTUDIANTE!D22)","v":"    "}]
[16,{"$f":"CONCATENATE(FILIACION_ESTUDIANTE!B23,\"  \",FILIACION_ESTUDIANTE!C23,\"  \",FILIACION_ESTUDIANTE!D23)","v":"    "}]
[17,{"$f":"CONCATENATE(FILIACION_ESTUDIANTE!B24,\"  \",FILIACION_ESTUDIANTE!C24,\"  \",FILIACION_ESTUDIANTE!D24)","v":"    "}]
[18,{"$f":"CONCATENATE(FILIACION_ESTUDIANTE!B25,\"  \",FILIACION_ESTUDIANTE!C25,\"  \",FILIACION_ESTUDIANTE!D25)","v":"    "}]
[19,{"$f":"CONCATENATE(FILIACION_ESTUDIANTE!B26,\"  \",FILIACION_ESTUDIANTE!C26,\"  \",FILIACION_ESTUDIANTE!D26)","v":"    "}]
[20,{"$f":"CONCATENATE(FILIACION_ESTUDIANTE!B27,\"  \",FILIACION_ESTUDIANTE!C27,\"  \",FILIACION_ESTUDIANTE!D27)","v":"    "}]
[21,{"$f":"CONCATENATE(FILIACION_ESTUDIANTE!B28,\"  \",FILIACION_ESTUDIANTE!C28,\"  \",FILIACION_ESTUDIANTE!D28)","v":"    "}]
[22,{"$f":"CONCATENATE(FILIACION_ESTUDIANTE!B29,\"  \",FILIACION_ESTUDIANTE!C29,\"  \",FILIACION_ESTUDIANTE!D29)","v":"    "}]
[23,{"$f":"CONCATENATE(FILIACION_ESTUDIANTE!B30,\"  \",FILIACION_ESTUDIANTE!C30,\"  \",FILIACION_ESTUDIANTE!D30)","v":"    "}]
[24,{"$f":"CONCATENATE(FILIACION_ESTUDIANTE!B31,\"  \",FILIACION_ESTUDIANTE!C31,\"  \",FILIACION_ESTUDIANTE!D31)","v":"    "}]
[25,{"$f":"CONCATENATE(FILIACION_ESTUDIANTE!B32,\"  \",FILIACION_ESTUDIANTE!C32,\"  \",FILIACION_ESTUDIANTE!D32)","v":"    "}]
[26,{"$f":"CONCATENATE(FILIACION_ESTUDIANTE!B33,\"  \",FILIACION_ESTUDIANTE!C33,\"  \",FILIACION_ESTUDIANTE!D33)","v":"    "}]
[27,{"$f":"CONCATENATE(FILIACION_ESTUDIANTE!B34,\"  \",FILIACION_ESTUDIANTE!C34,\"  \",FILIACION_ESTUDIANTE!D34)","v":"    "}]
[28,{"$f":"CONCATENATE(FILIACION_ESTUDIANTE!B35,\"  \",FILIACION_ESTUDIANTE!C35,\"  \",FILIACION_ESTUDIANTE!D35)","v":"    "}]
[29,{"$f":"CONCATENATE(FILIACION_ESTUDIANTE!B36,\"  \",FILIACION_ESTUDIANTE!C36,\"  \",FILIACION_ESTUDIANTE!D36)","v":"    "}]
[30,{"$f":"CONCATENATE(FILIACION_ESTUDIANTE!B37,\"  \",FILIACION_ESTUDIANTE!C37,\"  \",FILIACION_ESTUDIANTE!D37)","v":"    "}]
[31,{"$f":"CONCATENATE(FILIACION_ESTUDIANTE!B38,\"  \",FILIACION_ESTUDIANTE!C38,\"  \",FILIACION_ESTUDIANTE!D38)","v":"    "}]
[32,{"$f":"CONCATENATE(FILIACION_ESTUDIANTE!B39,\"  \",FILIACION_ESTUDIANTE!C39,\"  \",FILIACION_ESTUDIANTE!D39)","v":"    "}]
[33,{"$f":"CONCATENATE(FILIACION_ESTUDIANTE!B40,\"  \",FILIACION_ESTUDIANTE!C40,\"  \",FILIACION_ESTUDIANTE!D40)","v":"    "}]
[34,{"$f":"CONCATENATE(FILIACION_ESTUDIANTE!B41,\"  \",FILIACION_ESTUDIANTE!C41,\"  \",FILIACION_ESTUDIANTE!D41)","v":"    "}]
[35,{"$f":"CONCATENATE(FILIACION_ESTUDIANTE!B42,\"  \",FILIACION_ESTUDIANTE!C42,\"  \",FILIACION_ESTUDIANTE!D42)","v":"    "}]
[36,{"$f":"CONCATENATE(FILIACION_ESTUDIANTE!B43,\"  \",FILIACION_ESTUDIANTE!C43,\"  \",FILIACION_ESTUDIANTE!D43)","v":"    "}]
[37,{"$f":"CONCATENATE(FILIACION_ESTUDIANTE!B44,\"  \",FILIACION_ESTUDIANTE!C44,\"  \",FILIACION_ESTUDIANTE!D44)","v":"    "}]
[38,{"$f":"CONCATENATE(FILIACION_ESTUDIANTE!B45,\"  \",FILIACION_ESTUDIANTE!C45,\"  \",FILIACION_ESTUDIANTE!D45)","v":"    "}]
[39,{"$f":"CONCATENATE(FILIACION_ESTUDIANTE!B46,\"  \",FILIACION_ESTUDIANTE!C46,\"  \",FILIACION_ESTUDIANTE!D46)","v":"    "},null,null,null,null,null,null,null,null,null,null,null,null,null,null,null,null,null,null,"TTTTTTTTT"]
[40,{"$f":"CONCATENATE(FILIACION_ESTUDIANTE!B47,\"  \",FILIACION_ESTUDIANTE!C47,\"  \",FILIACION_ESTUDIANTE!D47)","v":"    "},null,null,null,null,null,null,null,null,null,null,null,null,null,null,null,null,null,null,"TTTTTTTTT"]

{"sheet":"C. PRIMER B","index":37,"n_rows":44,"n_cols":6,"rows_kept":44,"cut":false,"hidden":false,"merged":[[0,18,0,20],[0,0,0,5],[1,0,1,1],[2,0,3,0],[1,2,1,3],[0,12,0,17],[2,1,3,1],[2,2,3,2],[2,3,3,3],[2,4,3,4],[2,5,3,5]]}
["CENTRALIZADOR  PRIMER BIMESTRE"]
["MAESTRA(O)",null,{"$f":"CARATULA!E20","v":0},null,"AÑO DE ESCOLARIDAD",{"$f":"CARATULA!E21","v":0}]
["N°","APELLIDOS Y NOMBRES","COMUNIDAD Y SOCIEDAD","CIENCIA , TECNOLOGÍA Y PRODUCCIÓN","VIDA TIERRA TERRITORIO","COSMOS Y PENSAMIENTO"]
[]
[1,{"$f":"CONCATENATE(FILIACION_ESTUDIANTE!B8,\"  \",FILIACION_ESTUDIANTE!C8,\"  \",FILIACION_ESTUDIANTE!D8)","v":"    "},{"$f":"COM_SOC_1B!U14","v":0},{"$f":"CIENCIA_TEC_1B!U14","v":0},{"$f":"VIDA_TIERRA_1B!U14","v":0},{"$f":"COSMOS_PENS_1B!U14","v":0}]
[2,{"$f":"CONCATENATE(FILIACION_ESTUDIANTE!B9,\"  \",FILIACION_ESTUDIANTE!C9,\"  \",FILIACION_ESTUDIANTE!D9)","v":"    "},{"$f":"COM_SOC_1B!U15","v":0},{"$f":"CIENCIA_TEC_1B!U15","v":0},{"$f":"VIDA_TIERRA_1B!U15","v":0},{"$f":"COSMOS_PENS_1B!U15","v":0}]
[3,{"$f":"CONCATENATE(FILIACION_ESTUDIANTE!B10,\"  \",FILIACION_ESTUDIANTE!C10,\"  \",FILIACION_ESTUDIANTE!D10)","v":"    "},{"$f":"COM_SOC_1B!U16","v":0},{"$f":"CIENCIA_TEC_1B!U16","v":0},{"$f":"VIDA_TIERRA_1B!U16","v":0},{"$f":"COSMOS_PENS_1B!U16","v":0}]
[4,{"$f":"CONCATENATE(FILIACION_ESTUDIANTE!B11,\"  \",FILIACION_ESTUDIANTE!C11,\"  \",FILIACION_ESTUDIANTE!D11)","v":"    "},{"$f":"COM_SOC_1B!U17","v":0},{"$f":"CIENCIA_TEC_1B!U17","v":0},{"$f":"VIDA_TIERRA_1B!U17","v":0},{"$f":"COSMOS_PENS_1B!U17","v":0}]
[5,{"$f":"CONCATENATE(FILIACION_ESTUDIANTE!B12,\"  \",FILIACION_ESTUDIANTE!C12,\"  \",FILIACION_ESTUDIANTE!D12)","v":"    "},{"$f":"COM_SOC_1B!U18","v":0},{"$f":"CIENCIA_TEC_1B!U18","v":0},{"$f":"VIDA_TIERRA_1B!U18","v":0},{"$f":"COSMOS_PENS_1B!U18","v":0}]
[6,{"$f":"CONCATENATE(FILIACION_ESTUDIANTE!B13,\"  \",FILIACION_ESTUDIANTE!C13,\"  \",FILIACION_ESTUDIANTE!D13)","v":"    "},{"$f":"COM_SOC_1B!U19","v":0},{"$f":"CIENCIA_TEC_1B!U19","v":0},{"$f":"VIDA_TIERRA_1B!U19","v":0},{"$f":"COSMOS_PENS_1B!U19","v":0}]
[7,{"$f":"CONCATENATE(FILIACION_ESTUDIANTE!B14,\"  \",FILIACION_ESTUDIANTE!C14,\"  \",FILIACION_ESTUDIANTE!D14)","v":"    "},{"$f":"COM_SOC_1B!U20","v":0},{"$f":"CIENCIA_TEC_1B!U20","v":0},{"$f":"VIDA_TIERRA_1B!U20","v":0},{"$f":"COSMOS_PENS_1B!U20","v":0}]
[8,{"$f":"CONCATENATE(FILIACION_ESTUDIANTE!B15,\"  \",FILIACION_ESTUDIANTE!C15,\"  \",FILIACION_ESTUDIANTE!D15)","v":"    "},{"$f":"COM_SOC_1B!U21","v":0},{"$f":"CIENCIA_TEC_1B!U21","v":0},{"$f":"VIDA_TIERRA_1B!U21","v":0},{"$f":"COSMOS_PENS_1B!U21","v":0}]
[9,{"$f":"CONCATENATE(FILIACION_ESTUDIANTE!B16,\"  \",FILIACION_ESTUDIANTE!C16,\"  \",FILIACION_ESTUDIANTE!D16)","v":"    "},{"$f":"COM_SOC_1B!U22","v":0},{"$f":"CIENCIA_TEC_1B!U22","v":0},{"$f":"VIDA_TIERRA_1B!U22","v":0},{"$f":"COSMOS_PENS_1B!U22","v":0}]
[10,{"$f":"CONCATENATE(FILIACION_ESTUDIANTE!B17,\"  \",FILIACION_ESTUDIANTE!C17,\"  \",FILIACION_ESTUDIANTE!D17)","v":"    "},{"$f":"COM_SOC_1B!U23","v":0},{"$f":"CIENCIA_TEC_1B!U23","v":0},{"$f":"VIDA_TIERRA_1B!U23","v":0},{"$f":"COSMOS_PENS_1B!U23","v":0}]
[11,{"$f":"CONCATENATE(FILIACION_ESTUDIANTE!B18,\"  \",FILIACION_ESTUDIANTE!C18,\"  \",FILIACION_ESTUDIANTE!D18)","v":"    "},{"$f":"COM_SOC_1B!U24","v":0},{"$f":"CIENCIA_TEC_1B!U24","v":0},{"$f":"VIDA_TIERRA_1B!U24","v":0},{"$f":"COSMOS_PENS_1B!U24","v":0}]
[12,{"$f":"CONCATENATE(FILIACION_ESTUDIANTE!B19,\"  \",FILIACION_ESTUDIANTE!C19,\"  \",FILIACION_ESTUDIANTE!D19)","v":"    "},{"$f":"COM_SOC_1B!U25","v":0},{"$f":"CIENCIA_TEC_1B!U25","v":0},{"$f":"VIDA_TIERRA_1B!U25","v":0},{"$f":"COSMOS_PENS_1B!U25","v":0}]
[13,{"$f":"CONCATENATE(FILIACION_ESTUDIANTE!B20,\"  \",FILIACION_ESTUDIANTE!C20,\"  \",FILIACION_ESTUDIANTE!D20)","v":"    "},{"$f":"COM_SOC_1B!U26","v":0},{"$f":"CIENCIA_TEC_1B!U26","v":0},{"$f":"VIDA_TIERRA_1B!U26","v":0},{"$f":"COSMOS_PENS_1B!U26","v":0}]
[14,{"$f":"CONCATENATE(FILIACION_ESTUDIANTE!B21,\"  \",FILIACION_ESTUDIANTE!C21,\"  \",FILIACION_ESTUDIANTE!D21)","v":"    "},{"$f":"COM_SOC_1B!U27","v":0},{"$f":"CIENCIA_TEC_1B!U27","v":0},{"$f":"VIDA_TIERRA_1B!U27","v":0},{"$f":"COSMOS_PENS_1B!U27","v":0}]
[15,{"$f":"CONCATENATE(FILIACION_ESTUDIANTE!B22,\"  \",FILIACION_ESTUDIANTE!C22,\"  \",FILIACION_ESTUDIANTE!D22)","v":"    "},{"$f":"COM_SOC_1B!U28","v":0},{"$f":"CIENCIA_TEC_1B!U28","v":0},{"$f":"VIDA_TIERRA_1B!U28","v":0},{"$f":"COSMOS_PENS_1B!U28","v":0}]
[16,{"$f":"CONCATENATE(FILIACION_ESTUDIANTE!B23,\"  \",FILIACION_ESTUDIANTE!C23,\"  \",FILIACION_ESTUDIANTE!D23)","v":"    "},{"$f":"COM_SOC_1B!U29","v":0},{"$f":"CIENCIA_TEC_1B!U29","v":0},{"$f":"VIDA_TIERRA_1B!U29","v":0},{"$f":"COSMOS_PENS_1B!U29","v":0}]
[17,{"$f":"CONCATENATE(FILIACION_ESTUDIANTE!B24,\"  \",FILIACION_ESTUDIANTE!C24,\"  \",FILIACION_ESTUDIANTE!D24)","v":"    "},{"$f":"COM_SOC_1B!U30","v":0},{"$f":"CIENCIA_TEC_1B!U30","v":0},{"$f":"VIDA_TIERRA_1B!U30","v":0},{"$f":"COSMOS_PENS_1B!U30","v":0}]
[18,{"$f":"CONCATENATE(FILIACION_ESTUDIANTE!B25,\"  \",FILIACION_ESTUDIANTE!C25,\"  \",FILIACION_ESTUDIANTE!D25)","v":"    "},{"$f":"COM_SOC_1B!U31","v":0},{"$f":"CIENCIA_TEC_1B!U31","v":0},{"$f":"VIDA_TIERRA_1B!U31","v":0},{"$f":"COSMOS_PENS_1B!U31","v":0}]
[19,{"$f":"CONCATENATE(FILIACION_ESTUDIANTE!B26,\"  \",FILIACION_ESTUDIANTE!C26,\"  \",FILIACION_ESTUDIANTE!D26)","v":"    "},{"$f":"COM_SOC_1B!U32","v":0},{"$f":"CIENCIA_TEC_1B!U32","v":0},{"$f":"VIDA_TIERRA_1B!U32","v":0},{"$f":"COSMOS_PENS_1B!U32","v":0}]
[20,{"$f":"CONCATENATE(FILIACION_ESTUDIANTE!B27,\"  \",FILIACION_ESTUDIANTE!C27,\"  \",FILIACION_ESTUDIANTE!D27)","v":"    "},{"$f":"COM_SOC_1B!U33","v":0},{"$f":"CIENCIA_TEC_1B!U33","v":0},{"$f":"VIDA_TIERRA_1B!U33","v":0},{"$f":"COSMOS_PENS_1B!U33","v":0}]
[21,{"$f":"CONCATENATE(FILIACION_ESTUDIANTE!B28,\"  \",FILIACION_ESTUDIANTE!C28,\"  \",FILIACION_ESTUDIANTE!D28)","v":"    "},{"$f":"COM_SOC_1B!U34","v":0},{"$f":"CIENCIA_TEC_1B!U34","v":0},{"$f":"VIDA_TIERRA_1B!U34","v":0},{"$f":"COSMOS_PENS_1B!U34","v":0}]
[22,{"$f":"CONCATENATE(FILIACION_ESTUDIANTE!B29,\"  \",FILIACION_ESTUDIANTE!C29,\"  \",FILIACION_ESTUDIANTE!D29)","v":"    "},{"$f":"COM_SOC_1B!U35","v":0},{"$f":"CIENCIA_TEC_1B!U35","v":0},{"$f":"VIDA_TIERRA_1B!U35","v":0},{"$f":"COSMOS_PENS_1B!U35","v":0}]
[23,{"$f":"CONCATENATE(FILIACION_ESTUDIANTE!B30,\"  \",FILIACION_ESTUDIANTE!C30,\"  \",FILIACION_ESTUDIANTE!D30)","v":"    "},{"$f":"COM_SOC_1B!U36","v":0},{"$f":"CIENCIA_TEC_1B!U36","v":0},{"$f":"VIDA_TIERRA_1B!U36","v":0},{"$f":"COSMOS_PENS_1B!U36","v":0}]
[24,{"$f":"CONCATENATE(FILIACION_ESTUDIANTE!B31,\"  \",FILIACION_ESTUDIANTE!C31,\"  \",FILIACION_ESTUDIANTE!D31)","v":"    "},{"$f":"COM_SOC_1B!U37","v":0},{"$f":"CIENCIA_TEC_1B!U37","v":0},{"$f":"VIDA_TIERRA_1B!U37","v":0},{"$f":"COSMOS_PENS_1B!U37","v":0}]
[25,{"$f":"CONCATENATE(FILIACION_ESTUDIANTE!B32,\"  \",FILIACION_ESTUDIANTE!C32,\"  \",FILIACION_ESTUDIANTE!D32)","v":"    "},{"$f":"COM_SOC_1B!U38","v":0},{"$f":"CIENCIA_TEC_1B!U38","v":0},{"$f":"VIDA_TIERRA_1B!U38","v":0},{"$f":"COSMOS_PENS_1B!U38","v":0}]
[26,{"$f":"CONCATENATE(FILIACION_ESTUDIANTE!B33,\"  \",FILIACION_ESTUDIANTE!C33,\"  \",FILIACION_ESTUDIANTE!D33)","v":"    "},{"$f":"COM_SOC_1B!U39","v":0},{"$f":"CIENCIA_TEC_1B!U39","v":0},{"$f":"VIDA_TIERRA_1B!U39","v":0},{"$f":"COSMOS_PENS_1B!U39","v":0}]
[27,{"$f":"CONCATENATE(FILIACION_ESTUDIANTE!B34,\"  \",FILIACION_ESTUDIANTE!C34,\"  \",FILIACION_ESTUDIANTE!D34)","v":"    "},{"$f":"COM_SOC_1B!U40","v":0},{"$f":"CIENCIA_TEC_1B!U40","v":0},{"$f":"VIDA_TIERRA_1B!U40","v":0},{"$f":"COSMOS_PENS_1B!U40","v":0}]
[28,{"$f":"CONCATENATE(FILIACION_ESTUDIANTE!B35,\"  \",FILIACION_ESTUDIANTE!C35,\"  \",FILIACION_ESTUDIANTE!D35)","v":"    "},{"$f":"COM_SOC_1B!U41","v":0},{"$f":"CIENCIA_TEC_1B!U41","v":0},{"$f":"VIDA_TIERRA_1B!U41","v":0},{"$f":"COSMOS_PENS_1B!U41","v":0}]
[29,{"$f":"CONCATENATE(FILIACION_ESTUDIANTE!B36,\"  \",FILIACION_ESTUDIANTE!C36,\"  \",FILIACION_ESTUDIANTE!D36)","v":"    "},{"$f":"COM_SOC_1B!U42","v":0},{"$f":"CIENCIA_TEC_1B!U42","v":0},{"$f":"VIDA_TIERRA_1B!U42","v":0},{"$f":"COSMOS_PENS_1B!U42","v":0}]
[30,{"$f":"CONCATENATE(FILIACION_ESTUDIANTE!B37,\"  \",FILIACION_ESTUDIANTE!C37,\"  \",FILIACION_ESTUDIANTE!D37)","v":"    "},{"$f":"COM_SOC_1B!U43","v":0},{"$f":"CIENCIA_TEC_1B!U43","v":0},{"$f":"VIDA_TIERRA_1B!U43","v":0},{"$f":"COSMOS_PENS_1B!U43","v":0}]
[31,{"$f":"CONCATENATE(FILIACION_ESTUDIANTE!B38,\"  \",FILIACION_ESTUDIANTE!C38,\"  \",FILIACION_ESTUDIANTE!D38)","v":"    "},{"$f":"COM_SOC_1B!U44","v":0},{"$f":"CIENCIA_TEC_1B!U44","v":0},{"$f":"VIDA_TIERRA_1B!U44","v":0},{"$f":"COSMOS_PENS_1B!U44","v":0}]
[32,{"$f":"CONCATENATE(FILIACION_ESTUDIANTE!B39,\"  \",FILIACION_ESTUDIANTE!C39,\"  \",FILIACION_ESTUDIANTE!D39)","v":"    "},{"$f":"COM_SOC_1B!U45","v":0},{"$f":"CIENCIA_TEC_1B!U45","v":0},{"$f":"VIDA_TIERRA_1B!U45","v":0},{"$f":"COSMOS_PENS_1B!U45","v":0}]
[33,{"$f":"CONCATENATE(FILIACION_ESTUDIANTE!B40,\"  \",FILIACION_ESTUDIANTE!C40,\"  \",FILIACION_ESTUDIANTE!D40)","v":"    "},{"$f":"COM_SOC_1B!U46","v":0},{"$f":"CIENCIA_TEC_1B!U46","v":0},{"$f":"VIDA_TIERRA_1B!U46","v":0},{"$f":"COSMOS_PENS_1B!U46","v":0}]
[34,{"$f":"CONCATENATE(FILIACION_ESTUDIANTE!B41,\"  \",FILIACION_ESTUDIANTE!C41,\"  \",FILIACION_ESTUDIANTE!D41)","v":"    "},{"$f":"COM_SOC_1B!U47","v":0},{"$f":"CIENCIA_TEC_1B!U47","v":0},{"$f":"VIDA_TIERRA_1B!U47","v":0},{"$f":"COSMOS_PENS_1B!U47","v":0}]
[35,{"$f":"CONCATENATE(FILIACION_ESTUDIANTE!B42,\"  \",FILIACION_ESTUDIANTE!C42,\"  \",FILIACION_ESTUDIANTE!D42)","v":"    "},{"$f":"COM_SOC_1B!U48","v":0},{"$f":"CIENCIA_TEC_1B!U48","v":0},{"$f":"VIDA_TIERRA_1B!U48","v":0},{"$f":"COSMOS_PENS_1B!U48","v":0}]
[36,{"$f":"CONCATENATE(FILIACION_ESTUDIANTE!B43,\"  \",FILIACION_ESTUDIANTE!C43,\"  \",FILIACION_ESTUDIANTE!D43)","v":"    "},{"$f":"COM_SOC_1B!U49","v":0},{"$f":"CIENCIA_TEC_1B!U49","v":0},{"$f":"VIDA_TIERRA_1B!U49","v":0},{"$f":"COSMOS_PENS_1B!U49","v":0}]
[37,{"$f":"CONCATENATE(FILIACION_ESTUDIANTE!B44,\"  \",FILIACION_ESTUDIANTE!C44,\"  \",FILIACION_ESTUDIANTE!D44)","v":"    "},{"$f":"COM_SOC_1B!U50","v":0},{"$f":"CIENCIA_TEC_1B!U50","v":0},{"$f":"VIDA_TIERRA_1B!U50","v":0},{"$f":"COSMOS_PENS_1B!U50","v":0}]
[38,{"$f":"CONCATENATE(FILIACION_ESTUDIANTE!B45,\"  \",FILIACION_ESTUDIANTE!C45,\"  \",FILIACION_ESTUDIANTE!D45)","v":"    "},{"$f":"COM_SOC_1B!U51","v":0},{"$f":"CIENCIA_TEC_1B!U51","v":0},{"$f":"VIDA_TIERRA_1B!U51","v":0},{"$f":"COSMOS_PENS_1B!U51","v":0}]
[39,{"$f":"CONCATENATE(FILIACION_ESTUDIANTE!B46,\"  \",FILIACION_ESTUDIANTE!C46,\"  \",FILIACION_ESTUDIANTE!D46)","v":"    "},{"$f":"COM_SOC_1B!U52","v":0},{"$f":"CIENCIA_TEC_1B!U52","v":0},{"$f":"VIDA_TIERRA_1B!U52","v":0},{"$f":"COSMOS_PENS_1B!U52","v":0}]
[40,{"$f":"CONCATENATE(FILIACION_ESTUDIANTE!B47,\"  \",FILIACION_ESTUDIANTE!C47,\"  \",FILIACION_ESTUDIANTE!D47)","v":"    "},{"$f":"COM_SOC_1B!U53","v":0},{"$f":"CIENCIA_TEC_1B!U53","v":0},{"$f":"VIDA_TIERRA_1B!U53","v":0},{"$f":"COSMOS_PENS_1B!U53","v":0}]

{"sheet":"C. SEGUNDO B","index":38,"n_rows":44,"n_cols":6,"rows_kept":44,"cut":false,"hidden":false,"merged":[[2,0,3,0],[0,0,0,5],[1,0,1,1],[1,4,1,5],[2,2,3,2],[2,3,3,3],[2,4,3,4],[2,5,3,5],[2,1,3,1]]}
["CENTRALIZADOR SEGUNDO BIMESTRE"]
["MAESTRA(O)",null,{"$f":"CARATULA!E20","v":0},"AÑO DE ESCOLARIDAD",{"$f":"CARATULA!E21","v":0}]
["N°","APELLIDOS Y NOMBRES","COMUNIDAD Y SOCIEDAD","CIENCIA , TECNOLOGÍA Y PRODUCCIÓN","VIDA TIERRA TERRITORIO","COSMOS Y PENSAMIENTO"]
[]
[1,{"$f":"CONCATENATE(FILIACION_ESTUDIANTE!B8,\"  \",FILIACION_ESTUDIANTE!C8,\"  \",FILIACION_ESTUDIANTE!D8)","v":"    "},{"$f":"COM_SOC_2B!U14","v":0},{"$f":"CIENCIA_TEC_2B!U14","v":0},{"$f":"VIDA_TIERRA_2B!U14","v":0},{"$f":"COSMOS_PENS_2B!U14","v":0}]
[2,{"$f":"CONCATENATE(FILIACION_ESTUDIANTE!B9,\"  \",FILIACION_ESTUDIANTE!C9,\"  \",FILIACION_ESTUDIANTE!D9)","v":"    "},{"$f":"COM_SOC_2B!U15","v":0},{"$f":"CIENCIA_TEC_2B!U15","v":0},{"$f":"VIDA_TIERRA_2B!U15","v":0},{"$f":"COSMOS_PENS_2B!U15","v":0}]
[3,{"$f":"CONCATENATE(FILIACION_ESTUDIANTE!B10,\"  \",FILIACION_ESTUDIANTE!C10,\"  \",FILIACION_ESTUDIANTE!D10)","v":"    "},{"$f":"COM_SOC_2B!U16","v":0},{"$f":"CIENCIA_TEC_2B!U16","v":0},{"$f":"VIDA_TIERRA_2B!U16","v":0},{"$f":"COSMOS_PENS_2B!U16","v":0}]
[4,{"$f":"CONCATENATE(FILIACION_ESTUDIANTE!B11,\"  \",FILIACION_ESTUDIANTE!C11,\"  \",FILIACION_ESTUDIANTE!D11)","v":"    "},{"$f":"COM_SOC_2B!U17","v":0},{"$f":"CIENCIA_TEC_2B!U17","v":0},{"$f":"VIDA_TIERRA_2B!U17","v":0},{"$f":"COSMOS_PENS_2B!U17","v":0}]
[5,{"$f":"CONCATENATE(FILIACION_ESTUDIANTE!B12,\"  \",FILIACION_ESTUDIANTE!C12,\"  \",FILIACION_ESTUDIANTE!D12)","v":"    "},{"$f":"COM_SOC_2B!U18","v":0},{"$f":"CIENCIA_TEC_2B!U18","v":0},{"$f":"VIDA_TIERRA_2B!U18","v":0},{"$f":"COSMOS_PENS_2B!U18","v":0}]
[6,{"$f":"CONCATENATE(FILIACION_ESTUDIANTE!B13,\"  \",FILIACION_ESTUDIANTE!C13,\"  \",FILIACION_ESTUDIANTE!D13)","v":"    "},{"$f":"COM_SOC_2B!U19","v":0},{"$f":"CIENCIA_TEC_2B!U19","v":0},{"$f":"VIDA_TIERRA_2B!U19","v":0},{"$f":"COSMOS_PENS_2B!U19","v":0}]
[7,{"$f":"CONCATENATE(FILIACION_ESTUDIANTE!B14,\"  \",FILIACION_ESTUDIANTE!C14,\"  \",FILIACION_ESTUDIANTE!D14)","v":"    "},{"$f":"COM_SOC_2B!U20","v":0},{"$f":"CIENCIA_TEC_2B!U20","v":0},{"$f":"VIDA_TIERRA_2B!U20","v":0},{"$f":"COSMOS_PENS_2B!U20","v":0}]
[8,{"$f":"CONCATENATE(FILIACION_ESTUDIANTE!B15,\"  \",FILIACION_ESTUDIANTE!C15,\"  \",FILIACION_ESTUDIANTE!D15)","v":"    "},{"$f":"COM_SOC_2B!U21","v":0},{"$f":"CIENCIA_TEC_2B!U21","v":0},{"$f":"VIDA_TIERRA_2B!U21","v":0},{"$f":"COSMOS_PENS_2B!U21","v":0}]
[9,{"$f":"CONCATENATE(FILIACION_ESTUDIANTE!B16,\"  \",FILIACION_ESTUDIANTE!C16,\"  \",FILIACION_ESTUDIANTE!D16)","v":"    "},{"$f":"COM_SOC_2B!U22","v":0},{"$f":"CIENCIA_TEC_2B!U22","v":0},{"$f":"VIDA_TIERRA_2B!U22","v":0},{"$f":"COSMOS_PENS_2B!U22","v":0}]
[10,{"$f":"CONCATENATE(FILIACION_ESTUDIANTE!B17,\"  \",FILIACION_ESTUDIANTE!C17,\"  \",FILIACION_ESTUDIANTE!D17)","v":"    "},{"$f":"COM_SOC_2B!U23","v":0},{"$f":"CIENCIA_TEC_2B!U23","v":0},{"$f":"VIDA_TIERRA_2B!U23","v":0},{"$f":"COSMOS_PENS_2B!U23","v":0}]
[11,{"$f":"CONCATENATE(FILIACION_ESTUDIANTE!B18,\"  \",FILIACION_ESTUDIANTE!C18,\"  \",FILIACION_ESTUDIANTE!D18)","v":"    "},{"$f":"COM_SOC_2B!U24","v":0},{"$f":"CIENCIA_TEC_2B!U24","v":0},{"$f":"VIDA_TIERRA_2B!U24","v":0},{"$f":"COSMOS_PENS_2B!U24","v":0}]
[12,{"$f":"CONCATENATE(FILIACION_ESTUDIANTE!B19,\"  \",FILIACION_ESTUDIANTE!C19,\"  \",FILIACION_ESTUDIANTE!D19)","v":"    "},{"$f":"COM_SOC_2B!U25","v":0},{"$f":"CIENCIA_TEC_2B!U25","v":0},{"$f":"VIDA_TIERRA_2B!U25","v":0},{"$f":"COSMOS_PENS_2B!U25","v":0}]
[13,{"$f":"CONCATENATE(FILIACION_ESTUDIANTE!B20,\"  \",FILIACION_ESTUDIANTE!C20,\"  \",FILIACION_ESTUDIANTE!D20)","v":"    "},{"$f":"COM_SOC_2B!U26","v":0},{"$f":"CIENCIA_TEC_2B!U26","v":0},{"$f":"VIDA_TIERRA_2B!U26","v":0},{"$f":"COSMOS_PENS_2B!U26","v":0}]
[14,{"$f":"CONCATENATE(FILIACION_ESTUDIANTE!B21,\"  \",FILIACION_ESTUDIANTE!C21,\"  \",FILIACION_ESTUDIANTE!D21)","v":"    "},{"$f":"COM_SOC_2B!U27","v":0},{"$f":"CIENCIA_TEC_2B!U27","v":0},{"$f":"VIDA_TIERRA_2B!U27","v":0},{"$f":"COSMOS_PENS_2B!U27","v":0}]
[15,{"$f":"CONCATENATE(FILIACION_ESTUDIANTE!B22,\"  \",FILIACION_ESTUDIANTE!C22,\"  \",FILIACION_ESTUDIANTE!D22)","v":"    "},{"$f":"COM_SOC_2B!U28","v":0},{"$f":"CIENCIA_TEC_2B!U28","v":0},{"$f":"VIDA_TIERRA_2B!U28","v":0},{"$f":"COSMOS_PENS_2B!U28","v":0}]
[16,{"$f":"CONCATENATE(FILIACION_ESTUDIANTE!B23,\"  \",FILIACION_ESTUDIANTE!C23,\"  \",FILIACION_ESTUDIANTE!D23)","v":"    "},{"$f":"COM_SOC_2B!U29","v":0},{"$f":"CIENCIA_TEC_2B!U29","v":0},{"$f":"VIDA_TIERRA_2B!U29","v":0},{"$f":"COSMOS_PENS_2B!U29","v":0}]
[17,{"$f":"CONCATENATE(FILIACION_ESTUDIANTE!B24,\"  \",FILIACION_ESTUDIANTE!C24,\"  \",FILIACION_ESTUDIANTE!D24)","v":"    "},{"$f":"COM_SOC_2B!U30","v":0},{"$f":"CIENCIA_TEC_2B!U30","v":0},{"$f":"VIDA_TIERRA_2B!U30","v":0},{"$f":"COSMOS_PENS_2B!U30","v":0}]
[18,{"$f":"CONCATENATE(FILIACION_ESTUDIANTE!B25,\"  \",FILIACION_ESTUDIANTE!C25,\"  \",FILIACION_ESTUDIANTE!D25)","v":"    "},{"$f":"COM_SOC_2B!U31","v":0},{"$f":"CIENCIA_TEC_2B!U31","v":0},{"$f":"VIDA_TIERRA_2B!U31","v":0},{"$f":"COSMOS_PENS_2B!U31","v":0}]
[19,{"$f":"CONCATENATE(FILIACION_ESTUDIANTE!B26,\"  \",FILIACION_ESTUDIANTE!C26,\"  \",FILIACION_ESTUDIANTE!D26)","v":"    "},{"$f":"COM_SOC_2B!U32","v":0},{"$f":"CIENCIA_TEC_2B!U32","v":0},{"$f":"VIDA_TIERRA_2B!U32","v":0},{"$f":"COSMOS_PENS_2B!U32","v":0}]
[20,{"$f":"CONCATENATE(FILIACION_ESTUDIANTE!B27,\"  \",FILIACION_ESTUDIANTE!C27,\"  \",FILIACION_ESTUDIANTE!D27)","v":"    "},{"$f":"COM_SOC_2B!U33","v":0},{"$f":"CIENCIA_TEC_2B!U33","v":0},{"$f":"VIDA_TIERRA_2B!U33","v":0},{"$f":"COSMOS_PENS_2B!U33","v":0}]
[21,{"$f":"CONCATENATE(FILIACION_ESTUDIANTE!B28,\"  \",FILIACION_ESTUDIANTE!C28,\"  \",FILIACION_ESTUDIANTE!D28)","v":"    "},{"$f":"COM_SOC_2B!U34","v":0},{"$f":"CIENCIA_TEC_2B!U34","v":0},{"$f":"VIDA_TIERRA_2B!U34","v":0},{"$f":"COSMOS_PENS_2B!U34","v":0}]
[22,{"$f":"CONCATENATE(FILIACION_ESTUDIANTE!B29,\"  \",FILIACION_ESTUDIANTE!C29,\"  \",FILIACION_ESTUDIANTE!D29)","v":"    "},{"$f":"COM_SOC_2B!U35","v":0},{"$f":"CIENCIA_TEC_2B!U35","v":0},{"$f":"VIDA_TIERRA_2B!U35","v":0},{"$f":"COSMOS_PENS_2B!U35","v":0}]
[23,{"$f":"CONCATENATE(FILIACION_ESTUDIANTE!B30,\"  \",FILIACION_ESTUDIANTE!C30,\"  \",FILIACION_ESTUDIANTE!D30)","v":"    "},{"$f":"COM_SOC_2B!U36","v":0},{"$f":"CIENCIA_TEC_2B!U36","v":0},{"$f":"VIDA_TIERRA_2B!U36","v":0},{"$f":"COSMOS_PENS_2B!U36","v":0}]
[24,{"$f":"CONCATENATE(FILIACION_ESTUDIANTE!B31,\"  \",FILIACION_ESTUDIANTE!C31,\"  \",FILIACION_ESTUDIANTE!D31)","v":"    "},{"$f":"COM_SOC_2B!U37","v":0},{"$f":"CIENCIA_TEC_2B!U37","v":0},{"$f":"VIDA_TIERRA_2B!U37","v":0},{"$f":"COSMOS_PENS_2B!U37","v":0}]
[25,{"$f":"CONCATENATE(FILIACION_ESTUDIANTE!B32,\"  \",FILIACION_ESTUDIANTE!C32,\"  \",FILIACION_ESTUDIANTE!D32)","v":"    "},{"$f":"COM_SOC_2B!U38","v":0},{"$f":"CIENCIA_TEC_2B!U38","v":0},{"$f":"VIDA_TIERRA_2B!U38","v":0},{"$f":"COSMOS_PENS_2B!U38","v":0}]
[26,{"$f":"CONCATENATE(FILIACION_ESTUDIANTE!B33,\"  \",FILIACION_ESTUDIANTE!C33,\"  \",FILIACION_ESTUDIANTE!D33)","v":"    "},{"$f":"COM_SOC_2B!U39","v":0},{"$f":"CIENCIA_TEC_2B!U39","v":0},{"$f":"VIDA_TIERRA_2B!U39","v":0},{"$f":"COSMOS_PENS_2B!U39","v":0}]
[27,{"$f":"CONCATENATE(FILIACION_ESTUDIANTE!B34,\"  \",FILIACION_ESTUDIANTE!C34,\"  \",FILIACION_ESTUDIANTE!D34)","v":"    "},{"$f":"COM_SOC_2B!U40","v":0},{"$f":"CIENCIA_TEC_2B!U40","v":0},{"$f":"VIDA_TIERRA_2B!U40","v":0},{"$f":"COSMOS_PENS_2B!U40","v":0}]
[28,{"$f":"CONCATENATE(FILIACION_ESTUDIANTE!B35,\"  \",FILIACION_ESTUDIANTE!C35,\"  \",FILIACION_ESTUDIANTE!D35)","v":"    "},{"$f":"COM_SOC_2B!U41","v":0},{"$f":"CIENCIA_TEC_2B!U41","v":0},{"$f":"VIDA_TIERRA_2B!U41","v":0},{"$f":"COSMOS_PENS_2B!U41","v":0}]
[29,{"$f":"CONCATENATE(FILIACION_ESTUDIANTE!B36,\"  \",FILIACION_ESTUDIANTE!C36,\"  \",FILIACION_ESTUDIANTE!D36)","v":"    "},{"$f":"COM_SOC_2B!U42","v":0},{"$f":"CIENCIA_TEC_2B!U42","v":0},{"$f":"VIDA_TIERRA_2B!U42","v":0},{"$f":"COSMOS_PENS_2B!U42","v":0}]
[30,{"$f":"CONCATENATE(FILIACION_ESTUDIANTE!B37,\"  \",FILIACION_ESTUDIANTE!C37,\"  \",FILIACION_ESTUDIANTE!D37)","v":"    "},{"$f":"COM_SOC_2B!U43","v":0},{"$f":"CIENCIA_TEC_2B!U43","v":0},{"$f":"VIDA_TIERRA_2B!U43","v":0},{"$f":"COSMOS_PENS_2B!U43","v":0}]
[31,{"$f":"CONCATENATE(FILIACION_ESTUDIANTE!B38,\"  \",FILIACION_ESTUDIANTE!C38,\"  \",FILIACION_ESTUDIANTE!D38)","v":"    "},{"$f":"COM_SOC_2B!U44","v":0},{"$f":"CIENCIA_TEC_2B!U44","v":0},{"$f":"VIDA_TIERRA_2B!U44","v":0},{"$f":"COSMOS_PENS_2B!U44","v":0}]
[32,{"$f":"CONCATENATE(FILIACION_ESTUDIANTE!B39,\"  \",FILIACION_ESTUDIANTE!C39,\"  \",FILIACION_ESTUDIANTE!D39)","v":"    "},{"$f":"COM_SOC_2B!U45","v":0},{"$f":"CIENCIA_TEC_2B!U45","v":0},{"$f":"VIDA_TIERRA_2B!U45","v":0},{"$f":"COSMOS_PENS_2B!U45","v":0}]
[33,{"$f":"CONCATENATE(FILIACION_ESTUDIANTE!B40,\"  \",FILIACION_ESTUDIANTE!C40,\"  \",FILIACION_ESTUDIANTE!D40)","v":"    "},{"$f":"COM_SOC_2B!U46","v":0},{"$f":"CIENCIA_TEC_2B!U46","v":0},{"$f":"VIDA_TIERRA_2B!U46","v":0},{"$f":"COSMOS_PENS_2B!U46","v":0}]
[34,{"$f":"CONCATENATE(FILIACION_ESTUDIANTE!B41,\"  \",FILIACION_ESTUDIANTE!C41,\"  \",FILIACION_ESTUDIANTE!D41)","v":"    "},{"$f":"COM_SOC_2B!U47","v":0},{"$f":"CIENCIA_TEC_2B!U47","v":0},{"$f":"VIDA_TIERRA_2B!U47","v":0},{"$f":"COSMOS_PENS_2B!U47","v":0}]
[35,{"$f":"CONCATENATE(FILIACION_ESTUDIANTE!B42,\"  \",FILIACION_ESTUDIANTE!C42,\"  \",FILIACION_ESTUDIANTE!D42)","v":"    "},{"$f":"COM_SOC_2B!U48","v":0},{"$f":"CIENCIA_TEC_2B!U48","v":0},{"$f":"VIDA_TIERRA_2B!U48","v":0},{"$f":"COSMOS_PENS_2B!U48","v":0}]
[36,{"$f":"CONCATENATE(FILIACION_ESTUDIANTE!B43,\"  \",FILIACION_ESTUDIANTE!C43,\"  \",FILIACION_ESTUDIANTE!D43)","v":"    "},{"$f":"COM_SOC_2B!U49","v":0},{"$f":"CIENCIA_TEC_2B!U49","v":0},{"$f":"VIDA_TIERRA_2B!U49","v":0},{"$f":"COSMOS_PENS_2B!U49","v":0}]
[37,{"$f":"CONCATENATE(FILIACION_ESTUDIANTE!B44,\"  \",FILIACION_ESTUDIANTE!C44,\"  \",FILIACION_ESTUDIANTE!D44)","v":"    "},{"$f":"COM_SOC_2B!U50","v":0},{"$f":"CIENCIA_TEC_2B!U50","v":0},{"$f":"VIDA_TIERRA_2B!U50","v":0},{"$f":"COSMOS_PENS_2B!U50","v":0}]
[38,{"$f":"CONCATENATE(FILIACION_ESTUDIANTE!B45,\"  \",FILIACION_ESTUDIANTE!C45,\"  \",FILIACION_ESTUDIANTE!D45)","v":"    "},{"$f":"COM_SOC_2B!U51","v":0},{"$f":"CIENCIA_TEC_2B!U51","v":0},{"$f":"VIDA_TIERRA_2B!U51","v":0},{"$f":"COSMOS_PENS_2B!U51","v":0}]
[39,{"$f":"CONCATENATE(FILIACION_ESTUDIANTE!B46,\"  \",FILIACION_ESTUDIANTE!C46,\"  \",FILIACION_ESTUDIANTE!D46)","v":"    "},{"$f":"COM_SOC_2B!U52","v":0},{"$f":"CIENCIA_TEC_2B!U52","v":0},{"$f":"VIDA_TIERRA_2B!U52","v":0},{"$f":"COSMOS_PENS_2B!U52","v":0}]
[40,{"$f":"CONCATENATE(FILIACION_ESTUDIANTE!B47,\"  \",FILIACION_ESTUDIANTE!C47,\"  \",FILIACION_ESTUDIANTE!D47)","v":"    "},{"$f":"COM_SOC_2B!U53","v":0},{"$f":"CIENCIA_TEC_2B!U53","v":0},{"$f":"VIDA_TIERRA_2B!U53","v":0},{"$f":"COSMOS_PENS_2B!U53","v":0}]

{"sheet":"C. TERCER B","index":39,"n_rows":44,"n_cols":6,"rows_kept":44,"cut":false,"hidden":false,"merged":[[2,1,3,1],[2,0,3,0],[0,0,0,5],[1,0,1,1],[1,4,1,5],[2,2,3,2],[2,3,3,3],[2,4,3,4],[2,5,3,5]]}
["CENTRALIZADOR TERCER BIMESTRE"]
["MAESTRA(O)",null,{"$f":"CARATULA!E20","v":0},"AÑO DE ESCOLARIDAD",{"$f":"CARATULA!E21","v":0}]
["N°","APELLIDOS Y NOMBRES","COMUNIDAD Y SOCIEDAD","CIENCIA , TECNOLOGÍA Y PRODUCCIÓN","VIDA TIERRA TERRITORIO","COSMOS Y PENSAMIENTO"]
[]
[1,{"$f":"CONCATENATE(FILIACION_ESTUDIANTE!B8,\"  \",FILIACION_ESTUDIANTE!C8,\"  \",FILIACION_ESTUDIANTE!D8)","v":"    "},{"$f":"COM_SOC_3B!U14","v":0},{"$f":"CIENCIA_TEC_3B!U14","v":0},{"$f":"VIDA_TIERRA_3B!U14","v":0},{"$f":"COM_SOC_3B!U14","v":0}]
[2,{"$f":"CONCATENATE(FILIACION_ESTUDIANTE!B9,\"  \",FILIACION_ESTUDIANTE!C9,\"  \",FILIACION_ESTUDIANTE!D9)","v":"    "},{"$f":"COM_SOC_3B!U15","v":0},{"$f":"CIENCIA_TEC_3B!U15","v":0},{"$f":"VIDA_TIERRA_3B!U15","v":0},{"$f":"COM_SOC_3B!U15","v":0}]
[3,{"$f":"CONCATENATE(FILIACION_ESTUDIANTE!B10,\"  \",FILIACION_ESTUDIANTE!C10,\"  \",FILIACION_ESTUDIANTE!D10)","v":"    "},{"$f":"COM_SOC_3B!U16","v":0},{"$f":"CIENCIA_TEC_3B!U16","v":0},{"$f":"VIDA_TIERRA_3B!U16","v":0},{"$f":"COM_SOC_3B!U16","v":0}]
[4,{"$f":"CONCATENATE(FILIACION_ESTUDIANTE!B11,\"  \",FILIACION_ESTUDIANTE!C11,\"  \",FILIACION_ESTUDIANTE!D11)","v":"    "},{"$f":"COM_SOC_3B!U17","v":0},{"$f":"CIENCIA_TEC_3B!U17","v":0},{"$f":"VIDA_TIERRA_3B!U17","v":0},{"$f":"COM_SOC_3B!U17","v":0}]
[5,{"$f":"CONCATENATE(FILIACION_ESTUDIANTE!B12,\"  \",FILIACION_ESTUDIANTE!C12,\"  \",FILIACION_ESTUDIANTE!D12)","v":"    "},{"$f":"COM_SOC_3B!U18","v":0},{"$f":"CIENCIA_TEC_3B!U18","v":0},{"$f":"VIDA_TIERRA_3B!U18","v":0},{"$f":"COM_SOC_3B!U18","v":0}]
[6,{"$f":"CONCATENATE(FILIACION_ESTUDIANTE!B13,\"  \",FILIACION_ESTUDIANTE!C13,\"  \",FILIACION_ESTUDIANTE!D13)","v":"    "},{"$f":"COM_SOC_3B!U19","v":0},{"$f":"CIENCIA_TEC_3B!U19","v":0},{"$f":"VIDA_TIERRA_3B!U19","v":0},{"$f":"COM_SOC_3B!U19","v":0}]
[7,{"$f":"CONCATENATE(FILIACION_ESTUDIANTE!B14,\"  \",FILIACION_ESTUDIANTE!C14,\"  \",FILIACION_ESTUDIANTE!D14)","v":"    "},{"$f":"COM_SOC_3B!U20","v":0},{"$f":"CIENCIA_TEC_3B!U20","v":0},{"$f":"VIDA_TIERRA_3B!U20","v":0},{"$f":"COM_SOC_3B!U20","v":0}]
[8,{"$f":"CONCATENATE(FILIACION_ESTUDIANTE!B15,\"  \",FILIACION_ESTUDIANTE!C15,\"  \",FILIACION_ESTUDIANTE!D15)","v":"    "},{"$f":"COM_SOC_3B!U21","v":0},{"$f":"CIENCIA_TEC_3B!U21","v":0},{"$f":"VIDA_TIERRA_3B!U21","v":0},{"$f":"COM_SOC_3B!U21","v":0}]
[9,{"$f":"CONCATENATE(FILIACION_ESTUDIANTE!B16,\"  \",FILIACION_ESTUDIANTE!C16,\"  \",FILIACION_ESTUDIANTE!D16)","v":"    "},{"$f":"COM_SOC_3B!U22","v":0},{"$f":"CIENCIA_TEC_3B!U22","v":0},{"$f":"VIDA_TIERRA_3B!U22","v":0},{"$f":"COM_SOC_3B!U22","v":0}]
[10,{"$f":"CONCATENATE(FILIACION_ESTUDIANTE!B17,\"  \",FILIACION_ESTUDIANTE!C17,\"  \",FILIACION_ESTUDIANTE!D17)","v":"    "},{"$f":"COM_SOC_3B!U23","v":0},{"$f":"CIENCIA_TEC_3B!U23","v":0},{"$f":"VIDA_TIERRA_3B!U23","v":0},{"$f":"COM_SOC_3B!U23","v":0}]
[11,{"$f":"CONCATENATE(FILIACION_ESTUDIANTE!B18,\"  \",FILIACION_ESTUDIANTE!C18,\"  \",FILIACION_ESTUDIANTE!D18)","v":"    "},{"$f":"COM_SOC_3B!U24","v":0},{"$f":"CIENCIA_TEC_3B!U24","v":0},{"$f":"VIDA_TIERRA_3B!U24","v":0},{"$f":"COM_SOC_3B!U24","v":0}]
[12,{"$f":"CONCATENATE(FILIACION_ESTUDIANTE!B19,\"  \",FILIACION_ESTUDIANTE!C19,\"  \",FILIACION_ESTUDIANTE!D19)","v":"    "},{"$f":"COM_SOC_3B!U25","v":0},{"$f":"CIENCIA_TEC_3B!U25","v":0},{"$f":"VIDA_TIERRA_3B!U25","v":0},{"$f":"COM_SOC_3B!U25","v":0}]
[13,{"$f":"CONCATENATE(FILIACION_ESTUDIANTE!B20,\"  \",FILIACION_ESTUDIANTE!C20,\"  \",FILIACION_ESTUDIANTE!D20)","v":"    "},{"$f":"COM_SOC_3B!U26","v":0},{"$f":"CIENCIA_TEC_3B!U26","v":0},{"$f":"VIDA_TIERRA_3B!U26","v":0},{"$f":"COM_SOC_3B!U26","v":0}]
[14,{"$f":"CONCATENATE(FILIACION_ESTUDIANTE!B21,\"  \",FILIACION_ESTUDIANTE!C21,\"  \",FILIACION_ESTUDIANTE!D21)","v":"    "},{"$f":"COM_SOC_3B!U27","v":0},{"$f":"CIENCIA_TEC_3B!U27","v":0},{"$f":"VIDA_TIERRA_3B!U27","v":0},{"$f":"COM_SOC_3B!U27","v":0}]
[15,{"$f":"CONCATENATE(FILIACION_ESTUDIANTE!B22,\"  \",FILIACION_ESTUDIANTE!C22,\"  \",FILIACION_ESTUDIANTE!D22)","v":"    "},{"$f":"COM_SOC_3B!U28","v":0},{"$f":"CIENCIA_TEC_3B!U28","v":0},{"$f":"VIDA_TIERRA_3B!U28","v":0},{"$f":"COM_SOC_3B!U28","v":0}]
[16,{"$f":"CONCATENATE(FILIACION_ESTUDIANTE!B23,\"  \",FILIACION_ESTUDIANTE!C23,\"  \",FILIACION_ESTUDIANTE!D23)","v":"    "},{"$f":"COM_SOC_3B!U29","v":0},{"$f":"CIENCIA_TEC_3B!U29","v":0},{"$f":"VIDA_TIERRA_3B!U29","v":0},{"$f":"COM_SOC_3B!U29","v":0}]
[17,{"$f":"CONCATENATE(FILIACION_ESTUDIANTE!B24,\"  \",FILIACION_ESTUDIANTE!C24,\"  \",FILIACION_ESTUDIANTE!D24)","v":"    "},{"$f":"COM_SOC_3B!U30","v":0},{"$f":"CIENCIA_TEC_3B!U30","v":0},{"$f":"VIDA_TIERRA_3B!U30","v":0},{"$f":"COM_SOC_3B!U30","v":0}]
[18,{"$f":"CONCATENATE(FILIACION_ESTUDIANTE!B25,\"  \",FILIACION_ESTUDIANTE!C25,\"  \",FILIACION_ESTUDIANTE!D25)","v":"    "},{"$f":"COM_SOC_3B!U31","v":0},{"$f":"CIENCIA_TEC_3B!U31","v":0},{"$f":"VIDA_TIERRA_3B!U31","v":0},{"$f":"COM_SOC_3B!U31","v":0}]
[19,{"$f":"CONCATENATE(FILIACION_ESTUDIANTE!B26,\"  \",FILIACION_ESTUDIANTE!C26,\"  \",FILIACION_ESTUDIANTE!D26)","v":"    "},{"$f":"COM_SOC_3B!U32","v":0},{"$f":"CIENCIA_TEC_3B!U32","v":0},{"$f":"VIDA_TIERRA_3B!U32","v":0},{"$f":"COM_SOC_3B!U32","v":0}]
[20,{"$f":"CONCATENATE(FILIACION_ESTUDIANTE!B27,\"  \",FILIACION_ESTUDIANTE!C27,\"  \",FILIACION_ESTUDIANTE!D27)","v":"    "},{"$f":"COM_SOC_3B!U33","v":0},{"$f":"CIENCIA_TEC_3B!U33","v":0},{"$f":"VIDA_TIERRA_3B!U33","v":0},{"$f":"COM_SOC_3B!U33","v":0}]
[21,{"$f":"CONCATENATE(FILIACION_ESTUDIANTE!B28,\"  \",FILIACION_ESTUDIANTE!C28,\"  \",FILIACION_ESTUDIANTE!D28)","v":"    "},{"$f":"COM_SOC_3B!U34","v":0},{"$f":"CIENCIA_TEC_3B!U34","v":0},{"$f":"VIDA_TIERRA_3B!U34","v":0},{"$f":"COM_SOC_3B!U34","v":0}]
[22,{"$f":"CONCATENATE(FILIACION_ESTUDIANTE!B29,\"  \",FILIACION_ESTUDIANTE!C29,\"  \",FILIACION_ESTUDIANTE!D29)","v":"    "},{"$f":"COM_SOC_3B!U35","v":0},{"$f":"CIENCIA_TEC_3B!U35","v":0},{"$f":"VIDA_TIERRA_3B!U35","v":0},{"$f":"COM_SOC_3B!U35","v":0}]
[23,{"$f":"CONCATENATE(FILIACION_ESTUDIANTE!B30,\"  \",FILIACION_ESTUDIANTE!C30,\"  \",FILIACION_ESTUDIANTE!D30)","v":"    "},{"$f":"COM_SOC_3B!U36","v":0},{"$f":"CIENCIA_TEC_3B!U36","v":0},{"$f":"VIDA_TIERRA_3B!U36","v":0},{"$f":"COM_SOC_3B!U36","v":0}]
[24,{"$f":"CONCATENATE(FILIACION_ESTUDIANTE!B31,\"  \",FILIACION_ESTUDIANTE!C31,\"  \",FILIACION_ESTUDIANTE!D31)","v":"    "},{"$f":"COM_SOC_3B!U37","v":0},{"$f":"CIENCIA_TEC_3B!U37","v":0},{"$f":"VIDA_TIERRA_3B!U37","v":0},{"$f":"COM_SOC_3B!U37","v":0}]
[25,{"$f":"CONCATENATE(FILIACION_ESTUDIANTE!B32,\"  \",FILIACION_ESTUDIANTE!C32,\"  \",FILIACION_ESTUDIANTE!D32)","v":"    "},{"$f":"COM_SOC_3B!U38","v":0},{"$f":"CIENCIA_TEC_3B!U38","v":0},{"$f":"VIDA_TIERRA_3B!U38","v":0},{"$f":"COM_SOC_3B!U38","v":0}]
[26,{"$f":"CONCATENATE(FILIACION_ESTUDIANTE!B33,\"  \",FILIACION_ESTUDIANTE!C33,\"  \",FILIACION_ESTUDIANTE!D33)","v":"    "},{"$f":"COM_SOC_3B!U39","v":0},{"$f":"CIENCIA_TEC_3B!U39","v":0},{"$f":"VIDA_TIERRA_3B!U39","v":0},{"$f":"COM_SOC_3B!U39","v":0}]
[27,{"$f":"CONCATENATE(FILIACION_ESTUDIANTE!B34,\"  \",FILIACION_ESTUDIANTE!C34,\"  \",FILIACION_ESTUDIANTE!D34)","v":"    "},{"$f":"COM_SOC_3B!U40","v":0},{"$f":"CIENCIA_TEC_3B!U40","v":0},{"$f":"VIDA_TIERRA_3B!U40","v":0},{"$f":"COM_SOC_3B!U40","v":0}]
[28,{"$f":"CONCATENATE(FILIACION_ESTUDIANTE!B35,\"  \",FILIACION_ESTUDIANTE!C35,\"  \",FILIACION_ESTUDIANTE!D35)","v":"    "},{"$f":"COM_SOC_3B!U41","v":0},{"$f":"CIENCIA_TEC_3B!U41","v":0},{"$f":"VIDA_TIERRA_3B!U41","v":0},{"$f":"COM_SOC_3B!U41","v":0}]
[29,{"$f":"CONCATENATE(FILIACION_ESTUDIANTE!B36,\"  \",FILIACION_ESTUDIANTE!C36,\"  \",FILIACION_ESTUDIANTE!D36)","v":"    "},{"$f":"COM_SOC_3B!U42","v":0},{"$f":"CIENCIA_TEC_3B!U42","v":0},{"$f":"VIDA_TIERRA_3B!U42","v":0},{"$f":"COM_SOC_3B!U42","v":0}]
[30,{"$f":"CONCATENATE(FILIACION_ESTUDIANTE!B37,\"  \",FILIACION_ESTUDIANTE!C37,\"  \",FILIACION_ESTUDIANTE!D37)","v":"    "},{"$f":"COM_SOC_3B!U43","v":0},{"$f":"CIENCIA_TEC_3B!U43","v":0},{"$f":"VIDA_TIERRA_3B!U43","v":0},{"$f":"COM_SOC_3B!U43","v":0}]
[31,{"$f":"CONCATENATE(FILIACION_ESTUDIANTE!B38,\"  \",FILIACION_ESTUDIANTE!C38,\"  \",FILIACION_ESTUDIANTE!D38)","v":"    "},{"$f":"COM_SOC_3B!U44","v":0},{"$f":"CIENCIA_TEC_3B!U44","v":0},{"$f":"VIDA_TIERRA_3B!U44","v":0},{"$f":"COM_SOC_3B!U44","v":0}]
[32,{"$f":"CONCATENATE(FILIACION_ESTUDIANTE!B39,\"  \",FILIACION_ESTUDIANTE!C39,\"  \",FILIACION_ESTUDIANTE!D39)","v":"    "},{"$f":"COM_SOC_3B!U45","v":0},{"$f":"CIENCIA_TEC_3B!U45","v":0},{"$f":"VIDA_TIERRA_3B!U45","v":0},{"$f":"COM_SOC_3B!U45","v":0}]
[33,{"$f":"CONCATENATE(FILIACION_ESTUDIANTE!B40,\"  \",FILIACION_ESTUDIANTE!C40,\"  \",FILIACION_ESTUDIANTE!D40)","v":"    "},{"$f":"COM_SOC_3B!U46","v":0},{"$f":"CIENCIA_TEC_3B!U46","v":0},{"$f":"VIDA_TIERRA_3B!U46","v":0},{"$f":"COM_SOC_3B!U46","v":0}]
[34,{"$f":"CONCATENATE(FILIACION_ESTUDIANTE!B41,\"  \",FILIACION_ESTUDIANTE!C41,\"  \",FILIACION_ESTUDIANTE!D41)","v":"    "},{"$f":"COM_SOC_3B!U47","v":0},{"$f":"CIENCIA_TEC_3B!U47","v":0},{"$f":"VIDA_TIERRA_3B!U47","v":0},{"$f":"COM_SOC_3B!U47","v":0}]
[35,{"$f":"CONCATENATE(FILIACION_ESTUDIANTE!B42,\"  \",FILIACION_ESTUDIANTE!C42,\"  \",FILIACION_ESTUDIANTE!D42)","v":"    "},{"$f":"COM_SOC_3B!U48","v":0},{"$f":"CIENCIA_TEC_3B!U48","v":0},{"$f":"VIDA_TIERRA_3B!U48","v":0},{"$f":"COM_SOC_3B!U48","v":0}]
[36,{"$f":"CONCATENATE(FILIACION_ESTUDIANTE!B43,\"  \",FILIACION_ESTUDIANTE!C43,\"  \",FILIACION_ESTUDIANTE!D43)","v":"    "},{"$f":"COM_SOC_3B!U49","v":0},{"$f":"CIENCIA_TEC_3B!U49","v":0},{"$f":"VIDA_TIERRA_3B!U49","v":0},{"$f":"COM_SOC_3B!U49","v":0}]
[37,{"$f":"CONCATENATE(FILIACION_ESTUDIANTE!B44,\"  \",FILIACION_ESTUDIANTE!C44,\"  \",FILIACION_ESTUDIANTE!D44)","v":"    "},{"$f":"COM_SOC_3B!U50","v":0},{"$f":"CIENCIA_TEC_3B!U50","v":0},{"$f":"VIDA_TIERRA_3B!U50","v":0},{"$f":"COM_SOC_3B!U50","v":0}]
[38,{"$f":"CONCATENATE(FILIACION_ESTUDIANTE!B45,\"  \",FILIACION_ESTUDIANTE!C45,\"  \",FILIACION_ESTUDIANTE!D45)","v":"    "},{"$f":"COM_SOC_3B!U51","v":0},{"$f":"CIENCIA_TEC_3B!U51","v":0},{"$f":"VIDA_TIERRA_3B!U51","v":0},{"$f":"COM_SOC_3B!U51","v":0}]
[39,{"$f":"CONCATENATE(FILIACION_ESTUDIANTE!B46,\"  \",FILIACION_ESTUDIANTE!C46,\"  \",FILIACION_ESTUDIANTE!D46)","v":"    "},{"$f":"COM_SOC_3B!U52","v":0},{"$f":"CIENCIA_TEC_3B!U52","v":0},{"$f":"VIDA_TIERRA_3B!U52","v":0},{"$f":"COM_SOC_3B!U52","v":0}]
[40,{"$f":"CONCATENATE(FILIACION_ESTUDIANTE!B47,\"  \",FILIACION_ESTUDIANTE!C47,\"  \",FILIACION_ESTUDIANTE!D47)","v":"    "},{"$f":"COM_SOC_3B!U53","v":0},{"$f":"CIENCIA_TEC_3B!U53","v":0},{"$f":"VIDA_TIERRA_3B!U53","v":0},{"$f":"COM_SOC_3B!U53","v":0}]

{"sheet":"C. CUARTO B","index":40,"n_rows":44,"n_cols":6,"rows_kept":44,"cut":false,"hidden":false,"merged":[[2,1,3,1],[2,0,3,0],[0,0,0,5],[1,0,1,1],[1,4,1,5],[2,2,3,2],[2,3,3,3],[2,4,3,4],[2,5,3,5]]}
["CENTRALIZADOR CUARTO BIMESTRE"]
["MAESTRA(O)",null,{"$f":"CARATULA!E20","v":0},"AÑO DE ESCOLARIDAD",{"$f":"CARATULA!E21","v":0}]
["N°","APELLIDOS Y NOMBRES","COMUNIDAD Y SOCIEDAD","CIENCIA , TECNOLOGÍA Y PRODUCCIÓN","VIDA TIERRA TERRITORIO","COSMOS Y PENSAMIENTO"]
[]
[1,{"$f":"CONCATENATE(FILIACION_ESTUDIANTE!B8,\"  \",FILIACION_ESTUDIANTE!C8,\"  \",FILIACION_ESTUDIANTE!D8)","v":"    "},{"$f":"COM_SOC_4B!U14","v":0},{"$f":"CIENCIA_TEC_4B!U14","v":0},{"$f":"VIDA_TIERRA_4B!U14","v":0},{"$f":"COSMOS_PENS_4B!U14","v":0}]
[2,{"$f":"CONCATENATE(FILIACION_ESTUDIANTE!B9,\"  \",FILIACION_ESTUDIANTE!C9,\"  \",FILIACION_ESTUDIANTE!D9)","v":"    "},{"$f":"COM_SOC_4B!U15","v":0},{"$f":"CIENCIA_TEC_4B!U15","v":0},{"$f":"VIDA_TIERRA_4B!U15","v":0},{"$f":"COSMOS_PENS_4B!U15","v":0}]
[3,{"$f":"CONCATENATE(FILIACION_ESTUDIANTE!B10,\"  \",FILIACION_ESTUDIANTE!C10,\"  \",FILIACION_ESTUDIANTE!D10)","v":"    "},{"$f":"COM_SOC_4B!U16","v":0},{"$f":"CIENCIA_TEC_4B!U16","v":0},{"$f":"VIDA_TIERRA_4B!U16","v":0},{"$f":"COSMOS_PENS_4B!U16","v":0}]
[4,{"$f":"CONCATENATE(FILIACION_ESTUDIANTE!B11,\"  \",FILIACION_ESTUDIANTE!C11,\"  \",FILIACION_ESTUDIANTE!D11)","v":"    "},{"$f":"COM_SOC_4B!U17","v":0},{"$f":"CIENCIA_TEC_4B!U17","v":0},{"$f":"VIDA_TIERRA_4B!U17","v":0},{"$f":"COSMOS_PENS_4B!U17","v":0}]
[5,{"$f":"CONCATENATE(FILIACION_ESTUDIANTE!B12,\"  \",FILIACION_ESTUDIANTE!C12,\"  \",FILIACION_ESTUDIANTE!D12)","v":"    "},{"$f":"COM_SOC_4B!U18","v":0},{"$f":"CIENCIA_TEC_4B!U18","v":0},{"$f":"VIDA_TIERRA_4B!U18","v":0},{"$f":"COSMOS_PENS_4B!U18","v":0}]
[6,{"$f":"CONCATENATE(FILIACION_ESTUDIANTE!B13,\"  \",FILIACION_ESTUDIANTE!C13,\"  \",FILIACION_ESTUDIANTE!D13)","v":"    "},{"$f":"COM_SOC_4B!U19","v":"GGGGGGGG"},{"$f":"CIENCIA_TEC_4B!U19","v":0},{"$f":"VIDA_TIERRA_4B!U19","v":0},{"$f":"COSMOS_PENS_4B!U19","v":0}]
[7,{"$f":"CONCATENATE(FILIACION_ESTUDIANTE!B14,\"  \",FILIACION_ESTUDIANTE!C14,\"  \",FILIACION_ESTUDIANTE!D14)","v":"    "},{"$f":"COM_SOC_4B!U20","v":0},{"$f":"CIENCIA_TEC_4B!U20","v":0},{"$f":"VIDA_TIERRA_4B!U20","v":0},{"$f":"COSMOS_PENS_4B!U20","v":0}]
[8,{"$f":"CONCATENATE(FILIACION_ESTUDIANTE!B15,\"  \",FILIACION_ESTUDIANTE!C15,\"  \",FILIACION_ESTUDIANTE!D15)","v":"    "},{"$f":"COM_SOC_4B!U21","v":0},{"$f":"CIENCIA_TEC_4B!U21","v":0},{"$f":"VIDA_TIERRA_4B!U21","v":0},{"$f":"COSMOS_PENS_4B!U21","v":0}]
[9,{"$f":"CONCATENATE(FILIACION_ESTUDIANTE!B16,\"  \",FILIACION_ESTUDIANTE!C16,\"  \",FILIACION_ESTUDIANTE!D16)","v":"    "},{"$f":"COM_SOC_4B!U22","v":"GGGGGGGG"},{"$f":"CIENCIA_TEC_4B!U22","v":0},{"$f":"VIDA_TIERRA_4B!U22","v":0},{"$f":"COSMOS_PENS_4B!U22","v":0}]
[10,{"$f":"CONCATENATE(FILIACION_ESTUDIANTE!B17,\"  \",FILIACION_ESTUDIANTE!C17,\"  \",FILIACION_ESTUDIANTE!D17)","v":"    "},{"$f":"COM_SOC_4B!U23","v":0},{"$f":"CIENCIA_TEC_4B!U23","v":0},{"$f":"VIDA_TIERRA_4B!U23","v":0},{"$f":"COSMOS_PENS_4B!U23","v":0}]
[11,{"$f":"CONCATENATE(FILIACION_ESTUDIANTE!B18,\"  \",FILIACION_ESTUDIANTE!C18,\"  \",FILIACION_ESTUDIANTE!D18)","v":"    "},{"$f":"COM_SOC_4B!U24","v":0},{"$f":"CIENCIA_TEC_4B!U24","v":0},{"$f":"VIDA_TIERRA_4B!U24","v":0},{"$f":"COSMOS_PENS_4B!U24","v":0}]
[12,{"$f":"CONCATENATE(FILIACION_ESTUDIANTE!B19,\"  \",FILIACION_ESTUDIANTE!C19,\"  \",FILIACION_ESTUDIANTE!D19)","v":"    "},{"$f":"COM_SOC_4B!U25","v":"GGGGGGGG"},{"$f":"CIENCIA_TEC_4B!U25","v":0},{"$f":"VIDA_TIERRA_4B!U25","v":0},{"$f":"COSMOS_PENS_4B!U25","v":0}]
[13,{"$f":"CONCATENATE(FILIACION_ESTUDIANTE!B20,\"  \",FILIACION_ESTUDIANTE!C20,\"  \",FILIACION_ESTUDIANTE!D20)","v":"    "},{"$f":"COM_SOC_4B!U26","v":0},{"$f":"CIENCIA_TEC_4B!U26","v":0},{"$f":"VIDA_TIERRA_4B!U26","v":0},{"$f":"COSMOS_PENS_4B!U26","v":0}]
[14,{"$f":"CONCATENATE(FILIACION_ESTUDIANTE!B21,\"  \",FILIACION_ESTUDIANTE!C21,\"  \",FILIACION_ESTUDIANTE!D21)","v":"    "},{"$f":"COM_SOC_4B!U27","v":0},{"$f":"CIENCIA_TEC_4B!U27","v":0},{"$f":"VIDA_TIERRA_4B!U27","v":0},{"$f":"COSMOS_PENS_4B!U27","v":0}]
[15,{"$f":"CONCATENATE(FILIACION_ESTUDIANTE!B22,\"  \",FILIACION_ESTUDIANTE!C22,\"  \",FILIACION_ESTUDIANTE!D22)","v":"    "},{"$f":"COM_SOC_4B!U28","v":"GGGGGGGG"},{"$f":"CIENCIA_TEC_4B!U28","v":0},{"$f":"VIDA_TIERRA_4B!U28","v":0},{"$f":"COSMOS_PENS_4B!U28","v":0}]
[16,{"$f":"CONCATENATE(FILIACION_ESTUDIANTE!B23,\"  \",FILIACION_ESTUDIANTE!C23,\"  \",FILIACION_ESTUDIANTE!D23)","v":"    "},{"$f":"COM_SOC_4B!U29","v":0},{"$f":"CIENCIA_TEC_4B!U29","v":0},{"$f":"VIDA_TIERRA_4B!U29","v":0},{"$f":"COSMOS_PENS_4B!U29","v":0}]
[17,{"$f":"CONCATENATE(FILIACION_ESTUDIANTE!B24,\"  \",FILIACION_ESTUDIANTE!C24,\"  \",FILIACION_ESTUDIANTE!D24)","v":"    "},{"$f":"COM_SOC_4B!U30","v":0},{"$f":"CIENCIA_TEC_4B!U30","v":0},{"$f":"VIDA_TIERRA_4B!U30","v":0},{"$f":"COSMOS_PENS_4B!U30","v":0}]
[18,{"$f":"CONCATENATE(FILIACION_ESTUDIANTE!B25,\"  \",FILIACION_ESTUDIANTE!C25,\"  \",FILIACION_ESTUDIANTE!D25)","v":"    "},{"$f":"COM_SOC_4B!U31","v":"GGGGGGGG"},{"$f":"CIENCIA_TEC_4B!U31","v":0},{"$f":"VIDA_TIERRA_4B!U31","v":0},{"$f":"COSMOS_PENS_4B!U31","v":0}]
[19,{"$f":"CONCATENATE(FILIACION_ESTUDIANTE!B26,\"  \",FILIACION_ESTUDIANTE!C26,\"  \",FILIACION_ESTUDIANTE!D26)","v":"    "},{"$f":"COM_SOC_4B!U32","v":0},{"$f":"CIENCIA_TEC_4B!U32","v":0},{"$f":"VIDA_TIERRA_4B!U32","v":0},{"$f":"COSMOS_PENS_4B!U32","v":0}]
[20,{"$f":"CONCATENATE(FILIACION_ESTUDIANTE!B27,\"  \",FILIACION_ESTUDIANTE!C27,\"  \",FILIACION_ESTUDIANTE!D27)","v":"    "},{"$f":"COM_SOC_4B!U33","v":0},{"$f":"CIENCIA_TEC_4B!U33","v":0},{"$f":"VIDA_TIERRA_4B!U33","v":0},{"$f":"COSMOS_PENS_4B!U33","v":0}]
[21,{"$f":"CONCATENATE(FILIACION_ESTUDIANTE!B28,\"  \",FILIACION_ESTUDIANTE!C28,\"  \",FILIACION_ESTUDIANTE!D28)","v":"    "},{"$f":"COM_SOC_4B!U34","v":"GGGGGGGG"},{"$f":"CIENCIA_TEC_4B!U34","v":0},{"$f":"VIDA_TIERRA_4B!U34","v":0},{"$f":"COSMOS_PENS_4B!U34","v":0}]
[22,{"$f":"CONCATENATE(FILIACION_ESTUDIANTE!B29,\"  \",FILIACION_ESTUDIANTE!C29,\"  \",FILIACION_ESTUDIANTE!D29)","v":"    "},{"$f":"COM_SOC_4B!U35","v":0},{"$f":"CIENCIA_TEC_4B!U35","v":0},{"$f":"VIDA_TIERRA_4B!U35","v":0},{"$f":"COSMOS_PENS_4B!U35","v":0}]
[23,{"$f":"CONCATENATE(FILIACION_ESTUDIANTE!B30,\"  \",FILIACION_ESTUDIANTE!C30,\"  \",FILIACION_ESTUDIANTE!D30)","v":"    "},{"$f":"COM_SOC_4B!U36","v":0},{"$f":"CIENCIA_TEC_4B!U36","v":0},{"$f":"VIDA_TIERRA_4B!U36","v":0},{"$f":"COSMOS_PENS_4B!U36","v":0}]
[24,{"$f":"CONCATENATE(FILIACION_ESTUDIANTE!B31,\"  \",FILIACION_ESTUDIANTE!C31,\"  \",FILIACION_ESTUDIANTE!D31)","v":"    "},{"$f":"COM_SOC_4B!U37","v":"GGGGGGGG"},{"$f":"CIENCIA_TEC_4B!U37","v":0},{"$f":"VIDA_TIERRA_4B!U37","v":0},{"$f":"COSMOS_PENS_4B!U37","v":0}]
[25,{"$f":"CONCATENATE(FILIACION_ESTUDIANTE!B32,\"  \",FILIACION_ESTUDIANTE!C32,\"  \",FILIACION_ESTUDIANTE!D32)","v":"    "},{"$f":"COM_SOC_4B!U38","v":0},{"$f":"CIENCIA_TEC_4B!U38","v":0},{"$f":"VIDA_TIERRA_4B!U38","v":0},{"$f":"COSMOS_PENS_4B!U38","v":0}]
[26,{"$f":"CONCATENATE(FILIACION_ESTUDIANTE!B33,\"  \",FILIACION_ESTUDIANTE!C33,\"  \",FILIACION_ESTUDIANTE!D33)","v":"    "},{"$f":"COM_SOC_4B!U39","v":0},{"$f":"CIENCIA_TEC_4B!U39","v":0},{"$f":"VIDA_TIERRA_4B!U39","v":0},{"$f":"COSMOS_PENS_4B!U39","v":0}]
[27,{"$f":"CONCATENATE(FILIACION_ESTUDIANTE!B34,\"  \",FILIACION_ESTUDIANTE!C34,\"  \",FILIACION_ESTUDIANTE!D34)","v":"    "},{"$f":"COM_SOC_4B!U40","v":"GGGGGGGG"},{"$f":"CIENCIA_TEC_4B!U40","v":0},{"$f":"VIDA_TIERRA_4B!U40","v":0},{"$f":"COSMOS_PENS_4B!U40","v":0}]
[28,{"$f":"CONCATENATE(FILIACION_ESTUDIANTE!B35,\"  \",FILIACION_ESTUDIANTE!C35,\"  \",FILIACION_ESTUDIANTE!D35)","v":"    "},{"$f":"COM_SOC_4B!U41","v":0},{"$f":"CIENCIA_TEC_4B!U41","v":0},{"$f":"VIDA_TIERRA_4B!U41","v":0},{"$f":"COSMOS_PENS_4B!U41","v":0}]
[29,{"$f":"CONCATENATE(FILIACION_ESTUDIANTE!B36,\"  \",FILIACION_ESTUDIANTE!C36,\"  \",FILIACION_ESTUDIANTE!D36)","v":"    "},{"$f":"COM_SOC_4B!U42","v":0},{"$f":"CIENCIA_TEC_4B!U42","v":0},{"$f":"VIDA_TIERRA_4B!U42","v":0},{"$f":"COSMOS_PENS_4B!U42","v":0}]
[30,{"$f":"CONCATENATE(FILIACION_ESTUDIANTE!B37,\"  \",FILIACION_ESTUDIANTE!C37,\"  \",FILIACION_ESTUDIANTE!D37)","v":"    "},{"$f":"COM_SOC_4B!U43","v":"GGGGGGGG"},{"$f":"CIENCIA_TEC_4B!U43","v":0},{"$f":"VIDA_TIERRA_4B!U43","v":0},{"$f":"COSMOS_PENS_4B!U43","v":0}]
[31,{"$f":"CONCATENATE(FILIACION_ESTUDIANTE!B38,\"  \",FILIACION_ESTUDIANTE!C38,\"  \",FILIACION_ESTUDIANTE!D38)","v":"    "},{"$f":"COM_SOC_4B!U44","v":0},{"$f":"CIENCIA_TEC_4B!U44","v":0},{"$f":"VIDA_TIERRA_4B!U44","v":0},{"$f":"COSMOS_PENS_4B!U44","v":0}]
[32,{"$f":"CONCATENATE(FILIACION_ESTUDIANTE!B39,\"  \",FILIACION_ESTUDIANTE!C39,\"  \",FILIACION_ESTUDIANTE!D39)","v":"    "},{"$f":"COM_SOC_4B!U45","v":0},{"$f":"CIENCIA_TEC_4B!U45","v":0},{"$f":"VIDA_TIERRA_4B!U45","v":0},{"$f":"COSMOS_PENS_4B!U45","v":0}]
[33,{"$f":"CONCATENATE(FILIACION_ESTUDIANTE!B40,\"  \",FILIACION_ESTUDIANTE!C40,\"  \",FILIACION_ESTUDIANTE!D40)","v":"    "},{"$f":"COM_SOC_4B!U46","v":"GGGGGGGG"},{"$f":"CIENCIA_TEC_4B!U46","v":0},{"$f":"VIDA_TIERRA_4B!U46","v":0},{"$f":"COSMOS_PENS_4B!U46","v":0}]
[34,{"$f":"CONCATENATE(FILIACION_ESTUDIANTE!B41,\"  \",FILIACION_ESTUDIANTE!C41,\"  \",FILIACION_ESTUDIANTE!D41)","v":"    "},{"$f":"COM_SOC_4B!U47","v":0},{"$f":"CIENCIA_TEC_4B!U47","v":0},{"$f":"VIDA_TIERRA_4B!U47","v":0},{"$f":"COSMOS_PENS_4B!U47","v":0}]
[35,{"$f":"CONCATENATE(FILIACION_ESTUDIANTE!B42,\"  \",FILIACION_ESTUDIANTE!C42,\"  \",FILIACION_ESTUDIANTE!D42)","v":"    "},{"$f":"COM_SOC_4B!U48","v":0},{"$f":"CIENCIA_TEC_4B!U48","v":0},{"$f":"VIDA_TIERRA_4B!U48","v":0},{"$f":"COSMOS_PENS_4B!U48","v":0}]
[36,{"$f":"CONCATENATE(FILIACION_ESTUDIANTE!B43,\"  \",FILIACION_ESTUDIANTE!C43,\"  \",FILIACION_ESTUDIANTE!D43)","v":"    "},{"$f":"COM_SOC_4B!U49","v":"GGGGGGGG"},{"$f":"CIENCIA_TEC_4B!U49","v":0},{"$f":"VIDA_TIERRA_4B!U49","v":0},{"$f":"COSMOS_PENS_4B!U49","v":0}]
[37,{"$f":"CONCATENATE(FILIACION_ESTUDIANTE!B44,\"  \",FILIACION_ESTUDIANTE!C44,\"  \",FILIACION_ESTUDIANTE!D44)","v":"    "},{"$f":"COM_SOC_4B!U50","v":0},{"$f":"CIENCIA_TEC_4B!U50","v":0},{"$f":"VIDA_TIERRA_4B!U50","v":0},{"$f":"COSMOS_PENS_4B!U50","v":0}]
[38,{"$f":"CONCATENATE(FILIACION_ESTUDIANTE!B45,\"  \",FILIACION_ESTUDIANTE!C45,\"  \",FILIACION_ESTUDIANTE!D45)","v":"    "},{"$f":"COM_SOC_4B!U51","v":0},{"$f":"CIENCIA_TEC_4B!U51","v":0},{"$f":"VIDA_TIERRA_4B!U51","v":0},{"$f":"COSMOS_PENS_4B!U51","v":0}]
[39,{"$f":"CONCATENATE(FILIACION_ESTUDIANTE!B46,\"  \",FILIACION_ESTUDIANTE!C46,\"  \",FILIACION_ESTUDIANTE!D46)","v":"    "},{"$f":"COM_SOC_4B!U52","v":"GGGGGGGG"},{"$f":"CIENCIA_TEC_4B!U52","v":0},{"$f":"VIDA_TIERRA_4B!U52","v":"TTTTTTTTT"},{"$f":"COSMOS_PENS_4B!U52","v":0}]
[40,{"$f":"CONCATENATE(FILIACION_ESTUDIANTE!B47,\"  \",FILIACION_ESTUDIANTE!C47,\"  \",FILIACION_ESTUDIANTE!D47)","v":"    "},{"$f":"COM_SOC_4B!U53","v":0},{"$f":"CIENCIA_TEC_4B!U53","v":0},{"$f":"VIDA_TIERRA_4B!U53","v":"TTTTTTTTT"},{"$f":"COSMOS_PENS_4B!U53","v":0}]

{"sheet":"INFORME_ANUAL","index":41,"n_rows":47,"n_cols":30,"rows_kept":47,"cut":false,"hidden":false,"merged":[[5,0,5,1],[1,0,1,2],[2,0,2,2],[1,9,4,13],[4,0,4,1]]}
[]
["INFORME ANUAL",null,null,null,null,null,null,null,null,"REGISTRO DE VALORACION",null,null,null,null,"ED",null,null,null,null,null,null,null,"DA","DO",null,"DP"]
["EDUCACIÓN INICIAL  EN FAMILIA COMUNITARIA "]
[]
["MAESTRA (O):",null,{"$f":"CARATULA!E20","v":0}]
["AÑO DE ESCOLARIDAD",null,{"$f":"CARATULA!E21","v":0}]
["N°","APELLIDOS Y NOMBRES","INFORME ANUAL DEL PROCESO EDUCATIVO"]
[1,{"$f":"CONCATENATE(FILIACION_ESTUDIANTE!B8,\"  \",FILIACION_ESTUDIANTE!C8,\"  \",FILIACION_ESTUDIANTE!D8)","v":"    "},null,null,null,"demuestra  algunas actitudes armonicas etre sfamilia Y  LE FALTAT",null,null,null,{"$f":"IF(#REF!=#REF!,#REF!,IF(#REF!=#REF!,#REF!,IF(#REF!=#REF!,#REF!,IF(#REF!=#REF!,#REF!))))","v":{"$error":"#REF!"}},{"$f":"IF(#REF!=#REF!,#REF!,IF(#REF!=#REF!,#REF!,IF(#REF!=#REF!,#REF!,IF(#REF!=#REF!,#REF!))))","v":{"$error":"#REF!"}},{"$f":"IF(#REF!=#REF!,#REF!,IF(#REF!=#REF!,#REF!,IF(#REF!=#REF!,#REF!,IF(#REF!=#REF!,#REF!))))","v":{"$error":"#REF!"}},{"$f":"IF(#REF!=#REF!,#REF!,IF(#REF!=#REF!,#REF!,IF(#REF!=#REF!,#REF!,IF(#REF!=#REF!,#REF!))))","v":{"$error":"#REF!"}},{"$f":"SUM(J8:M8)","v":{"$error":"#REF!"}},{"$f":"IF(#REF!=#REF!,#REF!,IF(#REF!=#REF!,#REF!,IF(#REF!=#REF!,#REF!,IF(#REF!=#REF!,#REF!))))","v":{"$error":"#REF!"}},{"$f":"IF(#REF!=#REF!,#REF!,IF(#REF!=#REF!,#REF!,IF(#REF!=#REF!,#REF!,IF(#REF!=#REF!,#REF!))))","v":{"$error":"#REF!"}},{"$f":"IF(#REF!=#REF!,#REF!,IF(#REF!=#REF!,#REF!,IF(#REF!=#REF!,#REF!,IF(#REF!=#REF!,#REF!))))","v":{"$error":"#REF!"}},{"$f":"IF(#REF!=#REF!,#REF!,IF(#REF!=#REF!,#REF!,IF(#REF!=#REF!,#REF!,IF(#REF!=#REF!,#REF!))))","v":{"$error":"#REF!"}},{"$f":"SUM(O8:R8)","v":{"$error":"#REF!"}},{"$f":"IF(#REF!=#REF!,#REF!,IF(#REF!=#REF!,#REF!,IF(#REF!=#REF!,#REF!,IF(#REF!=#REF!,#REF!))))","v":{"$error":"#REF!"}},{"$f":"IF(#REF!=#REF!,#REF!,IF(#REF!=#REF!,#REF!,IF(#REF!=#REF!,#REF!,IF(#REF!=#REF!,#REF!))))","v":{"$error":"#REF!"}},{"$f":"IF(#REF!=#REF!,#REF!,IF(#REF!=#REF!,#REF!,IF(#REF!=#REF!,#REF!,IF(#REF!=#REF!,#REF!))))","v":{"$error":"#REF!"}},{"$f":"IF(#REF!=#REF!,#REF!,IF(#REF!=#REF!,#REF!,IF(#REF!=#REF!,#REF!,IF(#REF!=#REF!,#REF!))))","v":{"$error":"#REF!"}},{"$f":"SUM(T8:W8)","v":{"$error":"#REF!"}},{"$f":"IF(#REF!=#REF!,#REF!,IF(#REF!=#REF!,#REF!,IF(#REF!=#REF!,#REF!,IF(#REF!=#REF!,#REF!))))","v":{"$error":"#REF!"}},{"$f":"IF(#REF!=#REF!,#REF!,IF(#REF!=#REF!,#REF!,IF(#REF!=#REF!,#REF!,IF(#REF!=#REF!,#REF!))))","v":{"$error":"#REF!"}},{"$f":"IF(#REF!=#REF!,#REF!,IF(#REF!=#REF!,#REF!,IF(#REF!=#REF!,#REF!,IF(#REF!=#REF!,#REF!))))","v":{"$error":"#REF!"}},{"$f":"IF(#REF!=#REF!,#REF!,IF(#REF!=#REF!,#REF!,IF(#REF!=#REF!,#REF!,IF(#REF!=#REF!,#REF!))))","v":{"$error":"#REF!"}},{"$f":"SUM(Y8:AB8)","v":{"$error":"#REF!"}},{"$f":"MAX(N8,S8,X8,AC8)","v":{"$error":"#REF!"}}]
[2,{"$f":"CONCATENATE(FILIACION_ESTUDIANTE!B9,\"  \",FILIACION_ESTUDIANTE!C9,\"  \",FILIACION_ESTUDIANTE!D9)","v":"    "}]
[3,{"$f":"CONCATENATE(FILIACION_ESTUDIANTE!B10,\"  \",FILIACION_ESTUDIANTE!C10,\"  \",FILIACION_ESTUDIANTE!D10)","v":"    "}]
[4,{"$f":"CONCATENATE(FILIACION_ESTUDIANTE!B11,\"  \",FILIACION_ESTUDIANTE!C11,\"  \",FILIACION_ESTUDIANTE!D11)","v":"    "}]
[5,{"$f":"CONCATENATE(FILIACION_ESTUDIANTE!B12,\"  \",FILIACION_ESTUDIANTE!C12,\"  \",FILIACION_ESTUDIANTE!D12)","v":"    "}]
[6,{"$f":"CONCATENATE(FILIACION_ESTUDIANTE!B13,\"  \",FILIACION_ESTUDIANTE!C13,\"  \",FILIACION_ESTUDIANTE!D13)","v":"    "}]
[7,{"$f":"CONCATENATE(FILIACION_ESTUDIANTE!B14,\"  \",FILIACION_ESTUDIANTE!C14,\"  \",FILIACION_ESTUDIANTE!D14)","v":"    "}]
[8,{"$f":"CONCATENATE(FILIACION_ESTUDIANTE!B15,\"  \",FILIACION_ESTUDIANTE!C15,\"  \",FILIACION_ESTUDIANTE!D15)","v":"    "}]
[9,{"$f":"CONCATENATE(FILIACION_ESTUDIANTE!B16,\"  \",FILIACION_ESTUDIANTE!C16,\"  \",FILIACION_ESTUDIANTE!D16)","v":"    "}]
[10,{"$f":"CONCATENATE(FILIACION_ESTUDIANTE!B17,\"  \",FILIACION_ESTUDIANTE!C17,\"  \",FILIACION_ESTUDIANTE!D17)","v":"    "}]
[11,{"$f":"CONCATENATE(FILIACION_ESTUDIANTE!B18,\"  \",FILIACION_ESTUDIANTE!C18,\"  \",FILIACION_ESTUDIANTE!D18)","v":"    "}]
[12,{"$f":"CONCATENATE(FILIACION_ESTUDIANTE!B19,\"  \",FILIACION_ESTUDIANTE!C19,\"  \",FILIACION_ESTUDIANTE!D19)","v":"    "}]
[13,{"$f":"CONCATENATE(FILIACION_ESTUDIANTE!B20,\"  \",FILIACION_ESTUDIANTE!C20,\"  \",FILIACION_ESTUDIANTE!D20)","v":"    "}]
[14,{"$f":"CONCATENATE(FILIACION_ESTUDIANTE!B21,\"  \",FILIACION_ESTUDIANTE!C21,\"  \",FILIACION_ESTUDIANTE!D21)","v":"    "}]
[15,{"$f":"CONCATENATE(FILIACION_ESTUDIANTE!B22,\"  \",FILIACION_ESTUDIANTE!C22,\"  \",FILIACION_ESTUDIANTE!D22)","v":"    "}]
[16,{"$f":"CONCATENATE(FILIACION_ESTUDIANTE!B23,\"  \",FILIACION_ESTUDIANTE!C23,\"  \",FILIACION_ESTUDIANTE!D23)","v":"    "}]
[17,{"$f":"CONCATENATE(FILIACION_ESTUDIANTE!B24,\"  \",FILIACION_ESTUDIANTE!C24,\"  \",FILIACION_ESTUDIANTE!D24)","v":"    "}]
[18,{"$f":"CONCATENATE(FILIACION_ESTUDIANTE!B25,\"  \",FILIACION_ESTUDIANTE!C25,\"  \",FILIACION_ESTUDIANTE!D25)","v":"    "}]
[19,{"$f":"CONCATENATE(FILIACION_ESTUDIANTE!B26,\"  \",FILIACION_ESTUDIANTE!C26,\"  \",FILIACION_ESTUDIANTE!D26)","v":"    "}]
[20,{"$f":"CONCATENATE(FILIACION_ESTUDIANTE!B27,\"  \",FILIACION_ESTUDIANTE!C27,\"  \",FILIACION_ESTUDIANTE!D27)","v":"    "}]
[21,{"$f":"CONCATENATE(FILIACION_ESTUDIANTE!B28,\"  \",FILIACION_ESTUDIANTE!C28,\"  \",FILIACION_ESTUDIANTE!D28)","v":"    "}]
[22,{"$f":"CONCATENATE(FILIACION_ESTUDIANTE!B29,\"  \",FILIACION_ESTUDIANTE!C29,\"  \",FILIACION_ESTUDIANTE!D29)","v":"    "}]
[23,{"$f":"CONCATENATE(FILIACION_ESTUDIANTE!B30,\"  \",FILIACION_ESTUDIANTE!C30,\"  \",FILIACION_ESTUDIANTE!D30)","v":"    "}]
[24,{"$f":"CONCATENATE(FILIACION_ESTUDIANTE!B31,\"  \",FILIACION_ESTUDIANTE!C31,\"  \",FILIACION_ESTUDIANTE!D31)","v":"    "}]
[25,{"$f":"CONCATENATE(FILIACION_ESTUDIANTE!B32,\"  \",FILIACION_ESTUDIANTE!C32,\"  \",FILIACION_ESTUDIANTE!D32)","v":"    "}]
[26,{"$f":"CONCATENATE(FILIACION_ESTUDIANTE!B33,\"  \",FILIACION_ESTUDIANTE!C33,\"  \",FILIACION_ESTUDIANTE!D33)","v":"    "}]
[27,{"$f":"CONCATENATE(FILIACION_ESTUDIANTE!B34,\"  \",FILIACION_ESTUDIANTE!C34,\"  \",FILIACION_ESTUDIANTE!D34)","v":"    "}]
[28,{"$f":"CONCATENATE(FILIACION_ESTUDIANTE!B35,\"  \",FILIACION_ESTUDIANTE!C35,\"  \",FILIACION_ESTUDIANTE!D35)","v":"    "}]
[29,{"$f":"CONCATENATE(FILIACION_ESTUDIANTE!B36,\"  \",FILIACION_ESTUDIANTE!C36,\"  \",FILIACION_ESTUDIANTE!D36)","v":"    "}]
[30,{"$f":"CONCATENATE(FILIACION_ESTUDIANTE!B37,\"  \",FILIACION_ESTUDIANTE!C37,\"  \",FILIACION_ESTUDIANTE!D37)","v":"    "}]
[31,{"$f":"CONCATENATE(FILIACION_ESTUDIANTE!B38,\"  \",FILIACION_ESTUDIANTE!C38,\"  \",FILIACION_ESTUDIANTE!D38)","v":"    "}]
[32,{"$f":"CONCATENATE(FILIACION_ESTUDIANTE!B39,\"  \",FILIACION_ESTUDIANTE!C39,\"  \",FILIACION_ESTUDIANTE!D39)","v":"    "}]
[33,{"$f":"CONCATENATE(FILIACION_ESTUDIANTE!B40,\"  \",FILIACION_ESTUDIANTE!C40,\"  \",FILIACION_ESTUDIANTE!D40)","v":"    "}]
[34,{"$f":"CONCATENATE(FILIACION_ESTUDIANTE!B41,\"  \",FILIACION_ESTUDIANTE!C41,\"  \",FILIACION_ESTUDIANTE!D41)","v":"    "}]
[35,{"$f":"CONCATENATE(FILIACION_ESTUDIANTE!B42,\"  \",FILIACION_ESTUDIANTE!C42,\"  \",FILIACION_ESTUDIANTE!D42)","v":"    "}]
[36,{"$f":"CONCATENATE(FILIACION_ESTUDIANTE!B43,\"  \",FILIACION_ESTUDIANTE!C43,\"  \",FILIACION_ESTUDIANTE!D43)","v":"    "}]
[37,{"$f":"CONCATENATE(FILIACION_ESTUDIANTE!B44,\"  \",FILIACION_ESTUDIANTE!C44,\"  \",FILIACION_ESTUDIANTE!D44)","v":"    "}]
[38,{"$f":"CONCATENATE(FILIACION_ESTUDIANTE!B45,\"  \",FILIACION_ESTUDIANTE!C45,\"  \",FILIACION_ESTUDIANTE!D45)","v":"    "}]
[39,{"$f":"CONCATENATE(FILIACION_ESTUDIANTE!B46,\"  \",FILIACION_ESTUDIANTE!C46,\"  \",FILIACION_ESTUDIANTE!D46)","v":"    "}]
[40,{"$f":"CONCATENATE(FILIACION_ESTUDIANTE!B47,\"  \",FILIACION_ESTUDIANTE!C47,\"  \",FILIACION_ESTUDIANTE!D47)","v":"    "}]